{"text_format":"3","workbook":"xlsx","n_sheets":9,"sheets":["Zamówieni SUPER PRICE","rb01","rbk01","RIBS1","RIBS2","RIBS3","RIBS4","Cennik SUPER PRICE","Potwierdzenie parametrów"],"not_rendered":{"images":22,"macros":1,"external_links":1,"defined_names":19,"comments":1},"read":"whole","date_system":"1900"}

{"sheet":"Zamówieni SUPER PRICE","index":0,"n_rows":878,"n_cols":138,"rows_kept":878,"merged":[[0,0,0,10],[0,11,0,20],[0,21,0,28],[0,29,0,37],[0,38,0,43],[0,44,0,49],[0,52,7,52],[0,53,7,53],[0,54,7,54],[0,55,7,55],[0,56,7,56],[0,57,7,57],[0,58,7,58],[0,59,7,59],[0,60,7,60],[0,61,7,61],[0,62,7,62],[0,63,7,63],[0,64,7,64],[0,65,7,65],[0,66,7,66],[0,67,7,67],[0,68,7,68],[0,69,6,69],[0,70,6,70],[0,71,6,71],[0,72,6,72],[0,73,6,73],[0,74,6,74],[0,75,6,75],[0,76,6,76],[0,77,6,77],[0,84,6,84],[0,86,6,86],[0,88,6,88],[0,90,6,90],[0,92,6,92],[0,94,6,94],[0,98,7,98],[0,99,7,99],[0,102,7,102],[0,103,7,103],[0,106,7,106],[0,108,7,108],[0,109,7,109],[0,111,7,111],[0,112,7,112],[1,0,4,10],[1,11,4,20],[1,21,4,28],[1,29,4,37],[1,38,4,43],[1,44,2,44],[1,45,2,49],[3,44,4,44],[3,45,4,49],[6,0,6,49],[6,119,6,122],[7,1,7,2],[7,3,7,4],[7,6,7,7],[7,8,7,10],[7,11,7,12],[7,16,7,19],[7,20,7,22],[7,25,7,28],[7,29,7,32],[7,33,7,34],[7,35,7,37],[7,45,7,46],[7,47,7,49],[8,1,8,2],[8,3,8,4],[8,6,8,7],[8,8,8,10],[8,11,8,12],[8,16,8,19],[8,20,8,22],[8,25,8,28],[8,29,8,32],[8,33,8,34],[8,35,8,37],[8,45,8,46],[8,47,8,49],[9,1,9,2],[9,3,9,4],[9,6,9,7],[9,8,9,10],[9,11,9,12],[9,16,9,19],[9,20,9,22],[9,25,9,28],[9,29,9,32],[9,33,9,34],[9,35,9,37],[9,45,9,46],[9,47,9,49],[10,1,10,2],[10,3,10,4],[10,6,10,7],[10,8,10,10],[10,11,10,12],[10,16,10,19],[10,20,10,22],[10,25,10,28],[10,29,10,32],[10,33,10,34],[10,35,10,37],[10,45,10,46],[10,47,10,49],[11,6,11,7],[11,8,11,10],[11,11,11,12],[11,16,11,19],[11,20,11,22],[11,25,11,28],[11,29,11,32],[11,33,11,34],[11,35,11,37],[11,45,11,46],[11,47,11,49],[12,1,12,2],[12,3,12,4],[12,6,12,7],[12,8,12,10],[12,11,12,12],[12,16,12,19],[12,20,12,22],[12,25,12,28],[12,29,12,32],[12,33,12,34],[12,35,12,37],[12,45,12,46],[12,47,12,49],[13,1,13,2],[13,3,13,4],[13,6,13,7],[13,8,13,10],[13,11,13,12],[13,16,13,19],[13,20,13,22],[13,25,13,28],[13,29,13,32],[13,33,13,34],[13,35,13,37],[13,45,13,46],[13,47,13,49],[14,1,14,2],[14,3,14,4],[14,6,14,7],[14,8,14,10],[14,11,14,12],[14,16,14,19],[14,20,14,22],[14,25,14,28],[14,29,14,32],[14,33,14,34],[14,35,14,37],[14,45,14,46],[14,47,14,49],[15,1,15,2],[15,3,15,4],[15,6,15,7],[15,8,15,10],[15,11,15,12],[15,16,15,19],[15,20,15,22],[15,25,15,28],[15,29,15,32],[15,33,15,34],[15,35,15,37],[15,45,15,46],[15,47,15,49],[16,1,16,2],[16,3,16,4],[16,6,16,7],[16,8,16,10],[16,11,16,12],[16,16,16,19],[16,20,16,22],[16,25,16,28],[16,29,16,32],[16,33,16,34],[16,35,16,37],[16,45,16,46],[16,47,16,49],[17,1,17,2],[17,3,17,4],[17,6,17,7],[17,8,17,10],[17,11,17,12],[17,16,17,19],[17,20,17,22],[17,25,17,28],[17,29,17,32],[17,33,17,34],[17,35,17,37],[17,45,17,46],[17,47,17,49],[18,4,18,31],[18,32,18,34],[18,35,18,39],[18,40,18,44],[18,45,18,46],[18,47,18,49],[19,52,19,54],[20,30,20,49],[21,10,21,18],[21,19,21,20],[21,21,21,23],[21,24,21,29],[21,30,21,32],[21,33,21,49],[22,10,22,18],[22,19,22,20],[22,21,22,23],[22,24,22,29],[22,30,22,32],[22,33,22,49],[23,10,23,18],[23,19,23,20],[23,21,23,23],[23,24,23,29],[23,30,23,32],[24,0,24,8],[24,10,24,18],[24,19,24,20],[24,21,24,23],[24,24,24,29],[24,30,24,32],[25,0,25,8],[25,10,25,18],[25,19,25,20],[25,21,25,23],[25,24,25,29],[25,30,25,32],[25,33,25,49],[26,0,26,8],[26,10,26,18],[26,19,26,20],[26,21,26,23],[26,24,26,29],[26,30,26,32],[26,33,26,49],[27,0,27,8],[27,10,27,18],[27,19,27,20],[27,21,27,23],[27,24,27,29],[27,30,27,32],[27,33,27,49],[28,0,28,8],[28,10,28,18],[28,19,28,20],[28,21,28,23],[28,24,28,29],[28,30,28,32],[28,33,28,49],[29,10,29,18],[29,19,29,20],[29,21,29,23],[29,24,29,29],[29,30,29,32],[29,33,29,49],[30,9,31,20],[30,21,31,23],[30,24,30,29],[30,30,30,32],[30,33,30,49],[31,24,31,29],[31,30,31,32],[31,33,31,49],[32,9,33,20],[32,21,33,23],[32,24,32,49],[33,24,33,49],[35,0,35,24],[35,25,35,49],[37,1,37,9],[37,10,42,15],[37,17,37,28],[38,2,38,9],[39,2,39,9],[40,17,42,28],[44,1,44,9],[44,10,49,28],[45,2,45,9],[46,2,46,9],[47,2,47,9],[48,2,48,9],[49,2,49,9],[51,1,51,9],[52,2,52,9],[53,2,53,9],[54,2,54,9],[55,1,56,9],[58,1,58,9],[59,2,59,9],[60,2,60,9],[61,2,61,9],[62,1,63,9],[65,1,65,9],[65,10,70,20],[66,2,66,9],[67,2,67,9],[68,2,68,9],[72,1,72,8],[72,10,72,14],[72,16,73,28],[73,10,73,11],[73,12,73,14],[74,10,74,11],[74,12,74,14],[74,16,75,20],[74,21,75,28],[75,10,75,11],[75,12,75,14],[76,10,76,11],[76,12,76,14],[76,16,77,20],[76,21,77,28],[77,10,77,11],[77,12,77,14],[78,10,78,11],[78,12,78,14],[78,16,79,20],[78,21,79,28],[79,10,79,11],[79,12,79,14],[82,1,83,7],[82,8,83,14],[95,1,96,14]]}
["Nazwa firmy",{"$nulls":10},"Numeracja klienta",{"$nulls":9},"Data przyjęcia",{"$nulls":7},"Termin",{"$nulls":8},"Numeracja Tommarku",{"$nulls":5},"Dokumenty",{"$nulls":7},"lp.","Szerokość (cm)","Wysokość (cm)",{"$f":"I8","v":"System"},{"$f":"L8","v":"Model"},"typ","GRUPA TKANINY","liczba twistów ","Karnisz","GR1","GR2","GR3","GR4","GR5","GR6","Cena za roletę  wg tabel","CENA rolety ","Dopłata za silnik","Dopłata childsafety","Dopłata za opakowanie indywidualne","Dopłata za  metalowy łańcuch","Dopłata za poprzeczki przy samym karniszu","Dopłata z obciąznik przy samym karniszu","Dopłata za wieszak bezinwazyjny","Dopłata za żagiel","SUMA",{"$nulls":6},"Modele szycia",null,"Typ",null,"wykończenie tuneli",null,"wieszaki",null,"inny typ łańcuszka",null,"Kierunek wzoru ",{"$nulls":3},{"$f":"OFFSET($CV$8,MATCH(I9,$CU$9:$CU141,0),0,COUNTIF($CU$9:$CU$141,I9))","v":{"$error":"#N/A"}},"Tkanina",null,null,{"$f":"OFFSET($CZ$8,MATCH($I$9,$CY$9:$CY$11,0),0,COUNTIF($CY$9:$CY$11,I9))","v":{"$error":"#N/A"}},"Poprzeczki",null,null,"obciążniki",null,{"$f":"OFFSET($DF$8,MATCH(O9,$DE$9:$DE$15,0),0,COUNTIF($DE$9:$DE$15,O9))","v":{"$error":"#N/A"}},"Przełożenie mechanizmu",null,{"$f":"OFFSET($DI$8,MATCH(#REF!,$DH$9:$DH$57,0),0,COUNTIF($DH$9:$DH$57,#REF!))","v":{"$error":"#REF!"}},"Wysokość sterowania"]
[{"$nulls":44},"PW"]
[{"$nulls":80},"TAK"]
[{"$nulls":44},"FV"]
[{"$nulls":132},"Menu Tkaniny kolory"]
[{"$nulls":132},{"$f":"OFFSET($EC$7,MATCH(Q9,$EB$8:$EB$878,0),0,COUNTIF($EB$8:$EB$878,Q9))","v":{"$error":"#N/A"}},{"$nulls":3},"Tworzenie menu TKANIN tu wpisujemy numer grupy ","GR"]
["ROLETY RZYMSKIE - SUPER PRICE",{"$nulls":79},"Menu systemy Rolet rzymskich",{"$nulls":33},"Menu akcesoria do silników",{"$nulls":3},300,"UWAGI UPS",{"$nulls":4},"Tabela do zaczepów",null,null,{"$f":"OFFSET($DY$8,MATCH(I9,$DX$9:$DX$13,0),0,COUNTIF($DX$9:$DX$13,I9))","v":{"$error":"#N/A"}},{"$nulls":3},"tkanina ","kolor",null,null,"Viper",1,{"$f":"$EH$6&EG7&\"_\"&EF7","v":"GR1_Viper"}]
["№","Szerokość  (cm)",null,"Wysokość (cm)",null,"Szerokość tkaniny (cm)","Wysokość montażu (cm)",null,"System",null,null,"Model",null,"Typ","Rodzaj sterowania","Przełożenie mechanizmu","Tkanina",{"$nulls":3},"Kolor tkaniny",null,null,"Kierunek szycia","Mechanizm obok tkaniny ","Szprosy",{"$nulls":3},"Wykończenie  tuneli",{"$nulls":3},"Obciążnik",null,"Mocowanie górne",null,null,"Child safety","Inny łańcuszek","Lambrekin","Żagiel","Mankiet przeciw blaknięciu","Ostatni segment nie podczepiony","Pakowanie indywidualne","Ilość",null,"Cena",{"$nulls":21},"wg tabeli dopłat ",{"v":15,"d":"15.00 zł"},{"v":10,"d":"10.00 zł"},{"v":10,"d":"10.00 zł"},"wg tabeli dopłat ","wg tabeli dopłat ",{"v":8,"d":"8.00 zł"},{"v":0.3,"d":"30.00%"},"-",null,null,"SYSTEMY","numer systemu do wyliczeń",null,{"$f":"OFFSET($CG$8,MATCH(I9,$CF$9:$CF$15,0),0,COUNTIF($CF$9:$CF$15,I9))","v":{"$error":"#N/A"}},"numer modelu",{"$nulls":11},"STEROWANIE",{"$nulls":18},"towar","cena",null,"Wymiary paczki UPS ","Przekraczanie paczki UPS","Uwagi","informacja",null,null,"szerokosć","liczba twistów",null,"system","Opcja",null,"Viper",{"$f":"VLOOKUP(EA8,$EF$7:$EH$72,3,0)","v":"GR1_Viper"},"01",null,null,"Levante",1,"GR1_Levante"]
[1,{"$nulls":4},{"$f":"IF(Y9=\"TAK\",B9-2,B9)","v":{"v":0,"d":"0.0"}},{"$nulls":17},{"$f":"IF(B9=\"\",\"\",\"Pion\")","v":""},{"$nulls":23},{"$f":"AT9*BZ9","v":{"v":0,"d":"0.00 zł"}},{"$nulls":3},{"$f":"IF(AT9=\"\",0,1)","v":0},1,{"$f":"CEILING(B9,10)","v":0},{"$f":"CEILING(D9,10)","v":0},{"$f":"VLOOKUP(I9,$CC$9:$CD$11,2,0)","v":{"$error":"#N/A"}},{"$f":"L9","v":0},{"$f":"N9","v":0},{"$f":"MID(Q9,3,1)*1","v":{"$error":"#VALUE!"}},{"$f":"VLOOKUP(BB9,$DU$9:$DV$14,2,1)","v":2},{"$f":"HLOOKUP(BB9,'Cennik SUPER PRICE'!$C$263:$AC$264,2,0)","v":{"$error":"#N/A"}},{"$f":"INDEX(GR1_NK,MATCH($BC9,Produkt_H,0),MATCH($BB9,Produkt_W,0))","v":{"$error":"#N/A"}},{"$f":"INDEX(GR2_NK,MATCH($BC9,Produkt_H,0),MATCH($BB9,Produkt_W,0))","v":{"$error":"#N/A"}},{"$f":"INDEX(GR3_NK,MATCH($BC9,Produkt_H,0),MATCH($BB9,Produkt_W,0))","v":{"$error":"#N/A"}},{"$f":"INDEX(GR4_NK,MATCH($BC9,Produkt_H,0),MATCH($BB9,Produkt_W,0))","v":{"$error":"#N/A"}},{"$f":"INDEX(GR5_NK,MATCH($BC9,Produkt_H,0),MATCH($BB9,Produkt_W,0))","v":{"$error":"#N/A"}},{"$f":"INDEX(GR6_NK,MATCH($BC9,Produkt_H,0),MATCH($BB9,Produkt_W,0))","v":{"$error":"#N/A"}},{"$f":"IFERROR(IF(BG9=1,BJ9,IF(BG9=2,BK9,IF(BG9=3,BL9,IF(BG9=4,BM9,IF(BG9=5,BN9,IF(BG9=6,BO9,0)))))),0)","v":0},{"$f":"IFERROR(IF(BD9=1,BP9,IF(BD9=2,BP9,IF(BD9=3,BP9,IF(BD9=4,BI9,IF(BD9=5,BP9-BI9,0))))),0)","v":0},{"$f":"IF(O9=\"EY\",$DM$9,IF(O9=\"ES\",$DM$10,IF(O9=\"EM\",$DM$11,0)))*AT9","v":0},{"$f":"IF(AM9=\"TAK\",$BS$8,0)*AT9","v":0},{"$f":"IF(AS9=\"TAK\",$BT$8,0)*AT9","v":0},{"$f":"IF(AN9=\"Metalowy\",$BU$8,0)*AT9","v":0},{"$f":"IFERROR(IF(I9=\"KARNISZ\",INDEX(Doplaty_sam_karnisz,MATCH(Z9,rodzaj_doplat,0),MATCH(BB9,szer_doplat,0)),0)*(D9/20),0)","v":0},{"$f":"IFERROR(IF(I9=\"KARNISZ\",INDEX(Doplaty_sam_karnisz,MATCH(Z9,rodzaj_doplat,0),MATCH(BB9,szer_doplat,0)),0),0)","v":0},{"$f":"IF(AJ9=\"c. Uchwyt bezinwazyjny z twistem\",$BX$8*BH9,IF(AJ9=\"d. Uchwyt bezinwazyjnny z klipsem\",$BX$8*BH9,0))*AT9","v":0},{"$f":"IF(AP9=\"TAK\",BP9*$BY$8,0)*AT9","v":0},{"$f":"IFERROR(BQ9+BS9+BT9+BU9+BV9+BW9+BX9+BY9,0)","v":0},null,null,"Classic VRC",1,null,"Classic VRC",1,null,"A",null,"a. tunele odkryte",null,"a. Twist metalowy",null,"Kolorowy",null,"Pion",null,"CP",null,{"$f":"$CC$13","v":"RB VRC"},"GR1_RB",null,null,{"$f":"$CC$11","v":"TKANINA"},"a. Włókno szklane 4mm",null,null,"PS 5x20",null,{"$f":"$CS$9","v":"CP"},"1:1",null,{"$f":"$CS$9","v":"CP"},"50 cm",null,"Silnik DV24AF/L 12V","Silnik Yooda DV24AF/L",{"v":300,"d":"300.00 PLN"},null,{"$f":"11+11+11+11+B9+20","v":{"v":64,"d":"64.0"}},{"$f":"IF(DO9>$DO$7,DR9,\"\")","v":""},{"$f":"IF(DO9>$DO$7,\"Przekracza\",\"\")","v":""},"Pozycja 1 !BŁĄD001!",null,null,0,2,null,"Classic VRC",null,null,"Viper","GR1_Viper","02",null,null,"Astra",1,"GR1_Astra"]
[2,{"$nulls":4},{"v":0,"d":"0.0"},{"$nulls":17},"",{"$nulls":23},{"v":0,"d":"0.00 zł"},{"$nulls":3},0,2,0,0,{"$error":"#N/A"},0,0,{"$error":"#VALUE!"},{"$f":"VLOOKUP(BB10,$DU$9:$DV$14,2,1)","v":2},{"$f":"HLOOKUP(BB10,'Cennik SUPER PRICE'!$C$263:$AC$264,2,0)","v":{"$error":"#N/A"}},{"$error":"#N/A"},{"$error":"#N/A"},{"$error":"#N/A"},{"$error":"#N/A"},{"$error":"#N/A"},{"$error":"#N/A"},{"$f":"IFERROR(IF(BG10=1,BJ10,IF(BG10=2,BK10,IF(BG10=3,BL10,IF(BG10=4,BM10,IF(BG10=5,BN10,IF(BG10=6,BO10,0)))))),0)","v":0},{"$f":"IFERROR(IF(BD10=1,BP10,IF(BD10=2,BP10,IF(BD10=3,BP10,IF(BD10=4,BI10,IF(BD10=5,BP10-BI10,0))))),0)","v":0},0,0,0,0,0,0,0,0,{"$f":"IFERROR(BQ10+BS10+BT10+BU10+BV10+BW10+BX10+BY10,0)","v":0},null,null,"KARNISZ VRC",4,null,"Classic VRC",2,null,"B",null,"b. tunele zaszyte z jednej strony",null,"b. Klips metalowy",null,"Lexanowy",{"$nulls":3},"CL",null,{"$f":"$CC$12","v":"RIBS VRC"},{"$f":"EH7","v":"GR1_Viper"},null,null,{"$f":"$CC$9","v":"Classic VRC"},"a. Włókno szklane 4mm",null,null,"PCV 5x20",null,{"$f":"$CS$9","v":"CP"},"1:4",null,"CP","75 cm",null,"Silnik Somfy 12V","Silnik Somfy 12V",{"v":500,"d":"500.00 PLN"},null,{"v":64,"d":"64.0"},"","","Pozycja 2 !BŁĄD001!",null,null,70,3,null,"RIBS VRC","TAK",null,"Viper","GR1_Viper","03",null,null,"Italia",1,"GR1_Italia"]
[3,{"$nulls":4},{"v":0,"d":"0.0"},{"$nulls":17},{"$f":"IF(B11=\"\",\"\",\"Pion\")","v":""},{"$nulls":23},{"v":0,"d":"0.00 zł"},{"$nulls":3},0,3,0,0,{"$error":"#N/A"},0,0,{"$error":"#VALUE!"},2,{"$f":"HLOOKUP(BB11,'Cennik SUPER PRICE'!$C$263:$AC$264,2,0)","v":{"$error":"#N/A"}},{"$error":"#N/A"},{"$error":"#N/A"},{"$error":"#N/A"},{"$error":"#N/A"},{"$error":"#N/A"},{"$error":"#N/A"},0,0,0,0,0,0,0,0,0,0,0,null,null,"TKANINA",5,null,"RIBS VRC",1,null,"C",null,"c. tunele zaszyte z dwoch stron z oczkiem",null,"c. Uchwyt bezinwazyjny z twistem",null,"Metalowy",{"$nulls":3},"EY",null,"RIBS VRC",{"$f":"EH8","v":"GR1_Levante"},null,null,{"$f":"$CC$10","v":"KARNISZ VRC"},"a. Włókno szklane 4mm",null,null,"BRAK",null,{"$f":"$CS$10","v":"CL"},"1:1",null,"CP","100 cm",null,"Silnik Motion CM07 12V","Silnik Motion CM07 12V",{"v":300,"d":"300.00 PLN"},null,{"v":64,"d":"64.0"},"","","Pozycja 3 !BŁĄD001!",null,null,120,4,null,"RB VRC",null,null,"Viper","GR1_Viper","04",null,null,"Carrera",1,"GR1_Carrera"]
[4,{"$nulls":4},{"v":0,"d":"0.0"},{"$nulls":17},"",{"$nulls":23},{"v":0,"d":"0.00 zł"},{"$nulls":3},0,4,0,0,{"$error":"#N/A"},0,0,{"$error":"#VALUE!"},2,{"$f":"HLOOKUP(BB12,'Cennik SUPER PRICE'!$C$263:$AC$264,2,0)","v":{"$error":"#N/A"}},{"$error":"#N/A"},{"$error":"#N/A"},{"$error":"#N/A"},{"$error":"#N/A"},{"$error":"#N/A"},{"$error":"#N/A"},0,0,0,0,0,0,0,0,0,0,0,null,null,"RIBS VRC",2,null,"RB VRC",1,null,"D",{"$nulls":3},"d. Uchwyt bezinwazyjnny z klipsem",{"$nulls":5},"ES",null,"RIBS VRC","GR1_Astra",{"$nulls":8},{"$f":"$CS$10","v":"CL"},"1:4",null,"CP","125 cm",null,"Zasilacz do silnika Yooda DV24AF/L","Zasilacz YOODA",{"v":65,"d":"65.00 PLN"},null,{"v":64,"d":"64.0"},"","","Pozycja 4 !BŁĄD001!",null,null,170,5,null,"KARNISZ VRC",null,null,"Viper","GR1_Viper"," 05",null,null,"Cayenne",1,"GR1_Cayenne"]
[5,{"$nulls":4},{"v":0,"d":"0.0"},{"$nulls":17},"",{"$nulls":23},{"v":0,"d":"0.00 zł"},{"$nulls":3},0,5,0,0,{"$error":"#N/A"},0,0,{"$error":"#VALUE!"},2,{"$f":"HLOOKUP(BB13,'Cennik SUPER PRICE'!$C$263:$AC$264,2,0)","v":{"$error":"#N/A"}},{"$error":"#N/A"},{"$error":"#N/A"},{"$error":"#N/A"},{"$error":"#N/A"},{"$error":"#N/A"},{"$error":"#N/A"},0,0,0,0,0,0,0,0,0,0,0,null,null,"RB VRC",3,null,"KARNISZ VRC",null,null,"E",{"$nulls":9},"EM",null,"RIBS VRC","GR1_Italia",{"$nulls":8},{"$f":"$CS$11","v":"EY"},"niedotyczy",null,"CP","150 cm",null,"Ładowarka do napędów serii 25 LE (0,7 Nm)","Ładowarka YOODA",{"v":80,"d":"80.00 PLN"},null,{"v":64,"d":"64.0"},"","","Pozycja 5 !BŁĄD001!",null,null,220,6,null,"TKANINA",null,null,"Viper","GR1_Viper","06",null,null,"Macan",1,"GR1_Macan"]
[6,{"$nulls":4},{"v":0,"d":"0.0"},{"$nulls":17},"",{"$nulls":23},{"v":0,"d":"0.00 zł"},{"$nulls":3},0,6,0,0,{"$error":"#N/A"},0,0,{"$error":"#VALUE!"},2,{"$f":"HLOOKUP(BB14,'Cennik SUPER PRICE'!$C$263:$AC$264,2,0)","v":{"$error":"#N/A"}},{"$error":"#N/A"},{"$error":"#N/A"},{"$error":"#N/A"},{"$error":"#N/A"},{"$error":"#N/A"},{"$error":"#N/A"},0,0,0,0,0,0,0,0,0,0,0,{"$nulls":5},"TKANINA",1,{"$nulls":13},"RIBS VRC","GR1_Carrera",{"$nulls":8},{"$f":"$CS$12","v":"ES"},"niedotyczy",null,"CP","175 cm",null,"Bateria yooda zewnętrzna","Bateria YOODA",{"v":130,"d":"130.00 PLN"},null,{"v":64,"d":"64.0"},"","","Pozycja 6 !BŁĄD001!",null,null,270,7,{"$nulls":4},"Viper","GR1_Viper","V01",null,null,"Veyron",2,"GR2_Veyron"]
[7,{"$nulls":4},{"v":0,"d":"0.0"},{"$nulls":17},"",{"$nulls":23},{"v":0,"d":"0.00 zł"},{"$nulls":3},0,7,0,0,{"$error":"#N/A"},0,0,{"$error":"#VALUE!"},2,{"$f":"HLOOKUP(BB15,'Cennik SUPER PRICE'!$C$263:$AC$264,2,0)","v":{"$error":"#N/A"}},{"$error":"#N/A"},{"$error":"#N/A"},{"$error":"#N/A"},{"$error":"#N/A"},{"$error":"#N/A"},{"$error":"#N/A"},0,0,0,0,0,0,0,0,0,0,0,{"$nulls":5},"TKANINA",2,{"$nulls":13},"RIBS VRC","GR1_Cayenne",{"$nulls":8},"EM","niedotyczy",null,"CP","200 cm",null,"Zasilacz do silnika Motion","Zasilacz MOTION",{"v":70,"d":"70.00 PLN"},null,{"v":64,"d":"64.0"},"","","Pozycja 7 !BŁĄD001!",{"$nulls":8},"Viper","GR1_Viper","V02",null,null,"Huracan",2,"GR2_Huracan"]
[8,{"$nulls":4},{"v":0,"d":"0.0"},{"$nulls":17},"",{"$nulls":23},{"v":0,"d":"0.00 zł"},{"$nulls":3},0,8,0,0,{"$error":"#N/A"},0,0,{"$error":"#VALUE!"},2,{"$f":"HLOOKUP(BB16,'Cennik SUPER PRICE'!$C$263:$AC$264,2,0)","v":{"$error":"#N/A"}},{"$error":"#N/A"},{"$error":"#N/A"},{"$error":"#N/A"},{"$error":"#N/A"},{"$error":"#N/A"},{"$error":"#N/A"},0,0,0,0,0,0,0,0,0,0,0,{"$nulls":20},"RIBS VRC","GR1_Macan",{"$nulls":11},"CP","225 cm",null,"Ładowarka do napędów Motion","Ładowarka MOTION",{"v":120,"d":"120.00 PLN"},null,{"v":64,"d":"64.0"},"","","Pozycja 8 !BŁĄD001!",{"$nulls":8},"Viper","GR1_Viper","V03",null,null,"Vogue",2,"GR2_Vogue"]
[9,{"$nulls":4},{"v":0,"d":"0.0"},{"$nulls":17},"",{"$nulls":23},{"v":0,"d":"0.00 zł"},{"$nulls":3},0,9,0,0,{"$error":"#N/A"},0,0,{"$error":"#VALUE!"},2,{"$f":"HLOOKUP(BB17,'Cennik SUPER PRICE'!$C$263:$AC$264,2,0)","v":{"$error":"#N/A"}},{"$error":"#N/A"},{"$error":"#N/A"},{"$error":"#N/A"},{"$error":"#N/A"},{"$error":"#N/A"},{"$error":"#N/A"},0,0,0,0,0,0,0,0,0,0,0,{"$nulls":20},"RIBS VRC","GR2_Veyron",{"$nulls":11},"CP","250 cm",null,"Bateria motion","Bateria MOTION",{"v":210,"d":"210.00 PLN"},null,{"v":64,"d":"64.0"},"","","Pozycja 9 !BŁĄD001!",{"$nulls":8},"Viper","GR1_Viper","07",null,null,"Continental",3,"GR3_Continental"]
[10,{"$nulls":4},{"v":0,"d":"0.0"},{"$nulls":17},"",{"$nulls":23},{"v":0,"d":"0.00 zł"},{"$nulls":3},0,10,0,0,{"$error":"#N/A"},0,0,{"$error":"#VALUE!"},2,{"$f":"HLOOKUP(BB18,'Cennik SUPER PRICE'!$C$263:$AC$264,2,0)","v":{"$error":"#N/A"}},{"$error":"#N/A"},{"$error":"#N/A"},{"$error":"#N/A"},{"$error":"#N/A"},{"$error":"#N/A"},{"$error":"#N/A"},0,0,0,0,0,0,0,0,0,0,0,{"$nulls":20},"RIBS VRC","GR2_Huracan",{"$nulls":11},{"$f":"$CS$10","v":"CL"},"50 cm",null,"Zasilacz do silnika SOMFY","Zasilacz SOMFY",{"v":90,"d":"90.00 PLN"},null,{"v":64,"d":"64.0"},"","","Pozycja 10 !BŁĄD001!",{"$nulls":8},"Viper","GR1_Viper","08",null,null,"Pathfinder",3,"GR3_Pathfinder"]
[{"$nulls":4},"Razem: ",{"$nulls":27},{"v":0,"d":"0%"},null,null,"Cena po rabacie:",{"$nulls":4},{"$f":"AV19-(AV19*AG19)","v":{"v":0,"d":"0.00 zł"}},{"$nulls":4},"Razem:",null,{"$f":"SUM(AV9:AX18)","v":{"v":0,"d":"0.00 zł"}},{"$nulls":3},{"$f":"SUM(AZ9:AZ18)","v":0},{"$nulls":46},"RIBS VRC","GR2_Vogue",{"$nulls":11},"CL","75 cm",null,"Ładowarka do napędów SOMFY","Ładowarka SOMFY",{"v":80,"d":"80.00 PLN"},{"$nulls":13},"Viper","GR1_Viper","09",null,null,"Aventador",6,"GR6_Aventador"]
[{"$nulls":98},"RIBS VRC","GR3_Continental",{"$nulls":11},"CL","100 cm",null,"Bateria SOMFY","Bateria SOMFY",{"v":150,"d":"150.00 PLN"},{"$nulls":13},"Viper","GR1_Viper","V04",null,null,"Testarossa",1,"GR1_Testarossa"]
[{"$nulls":24},"Blędy",{"$nulls":5},"Uwagi",{"$nulls":67},"RIBS VRC",{"$f":"EH18","v":"GR3_Pathfinder"},{"$nulls":11},"CL","125 cm",null,"YOODA Pilot breloczek BRAVA 1-kanałowy","YOODA BRAVA 1CH",{"v":76,"d":"76.00 PLN"},{"$nulls":13},"Viper","GR1_Viper","10",null,null,"Nestor",3,"GR3_Nestor"]
[{"$nulls":24},{"$f":"DP9","v":""},{"$nulls":5},"Poz. 1",{"$nulls":67},"RIBS VRC","GR6_Aventador",{"$nulls":30},"Viper","GR1_Viper","11",null,null,"Niva",3,{"$f":"$EH$6&EG22&\"_\"&EF22","v":"GR3_Niva"}]
[{"$nulls":24},"",{"$nulls":5},"Poz. 2",{"$nulls":67},"RIBS VRC","GR1_Testarossa",{"$nulls":11},"CL","150 cm",null,"YOODA Pilot breloczek PORTA 1-kanałowy","YOODA PORTA 1CH",{"v":82,"d":"82.00 PLN"},{"$nulls":13},"Viper","GR1_Viper","12",null,null,"Mustang",3,"GR3_Mustang"]
[{"$nulls":24},"",{"$nulls":5},"Poz. 3",{"$nulls":67},"RIBS VRC","GR3_Nestor",{"$nulls":11},"CL","175 cm",null,"YOODA Pilot breloczek SKIDA 1-kanałowy","YOODA SKIDA 1CH",{"v":82,"d":"82.00 PLN"},{"$nulls":13},"Viper","GR1_Viper","V05",null,null,"Beetle",3,"GR3_Beetle"]
[{"$nulls":24},"",{"$nulls":5},"Poz. 4",{"$nulls":67},"RIBS VRC","GR3_Niva",{"$nulls":11},"CL","200 cm",null,"YOODA Pilot breloczek SKIDA 4-kanałowy","YOODA SKIDA 4CH",{"v":91,"d":"91.00 PLN"},{"$nulls":13},"Viper","GR1_Viper","13",null,null,"Mistral",3,"GR3_Mistral"]
["  Zamówienie należy wysłać na adres:",{"$nulls":23},"",{"$nulls":5},"Poz. 5",{"$nulls":67},"RIBS VRC","GR3_Mustang",{"$nulls":11},"CL","225 cm",null,"YOODA Pilot 1 kanałowy \" ARTISTIC \"","YOODA ARTISTIC 1CH",{"v":70,"d":"70.00 PLN"},{"$nulls":13},"Viper","GR1_Viper","V06",null,null,"Phantom",3,"GR3_Phantom"]
["  wyrobgotowy@tommark.pl",{"$nulls":23},"",{"$nulls":5},"Poz. 6",{"$nulls":67},"RIBS VRC","GR3_Beetle",{"$nulls":11},"CL","250 cm",null,"YOODA Pilot 5 kanałowy  \" ARTISTIC \"","YOODA ARTISTIC 5CH",{"v":80,"d":"80.00 PLN"},{"$nulls":13},"Viper","GR1_Viper","V07",null,null,"Ghost",3,"GR3_Ghost"]
["  Kontakt:",{"$nulls":23},"",{"$nulls":5},"Poz. 7",{"$nulls":67},"RIBS VRC","GR3_Mistral",{"$nulls":11},{"$f":"$CS$11","v":"EY"},"niedotyczy",null,"YOODA Pilot 15 kanałowy  \" ARTISTIC \"","YOODA ARTISTIC 15CH",{"v":90,"d":"90.00 PLN"},{"$nulls":13},"Viper","GR1_Viper","14",null,null,"Corniche",3,"GR3_Corniche"]
["  tel. +48 42 6 333 999",{"$nulls":23},"",{"$nulls":5},"Poz. 8",{"$nulls":67},"RIBS VRC","GR3_Phantom",{"$nulls":11},{"$f":"$CS$12","v":"ES"},"niedotyczy",null,"YOODA Pilot 1 kanałowy z programatorem czasowym  \" ARTISTIC \"","YOODA ARTISTIC 1CH T",{"v":90,"d":"90.00 PLN"},{"$nulls":13},"Viper","GR1_Viper","V08",null,null,"Leopard",4,"GR4_Leopard"]
[{"$nulls":24},"",{"$nulls":5},"Poz. 9",{"$nulls":67},"RIBS VRC","GR3_Ghost",{"$nulls":11},{"$f":"$CC$11","v":"TKANINA"},"niedotyczy",null,"YOODA Pilot 5 kanałowy z programatorem czasowym  \" ARTISTIC \"","YOODA ARTISTIC 5CH T",{"v":100,"d":"100.00 PLN"},{"$nulls":13},"Viper","GR1_Viper","V09",null,null,"Monte Carlo",3,"GR3_Monte Carlo"]
[{"$nulls":24},"",{"$nulls":5},"Poz.10",{"$nulls":67},"RIBS VRC","GR3_Corniche",{"$nulls":14},"YOODA Pilot 15 kanałowy z programatorem czasowym  \" ARTISTIC \"","YOODA ARTISTIC 15CH T",{"v":240,"d":"240.00 PLN"},{"$nulls":13},"Viper","GR1_Viper","V10",null,null,"Sebring",4,"GR4_Sebring"]
[{"$nulls":30},"Wszystkie",{"$nulls":67},"RIBS VRC","GR4_Leopard",{"$nulls":14},"YOODA Pilot 99 kanałowy z programatorem  czasowym           \"PIXEL\"","YOODA PIXEL 99CH",{"v":495,"d":"495.00 PLN"},{"$nulls":13},"Viper","GR1_Viper","15",null,null,"DeVille",4,"GR4_DeVille"]
[{"$nulls":9},"Łączna wartość zamówienia po rabacie",{"$nulls":11},{"$f":"AO19+V31","v":{"v":0,"d":"0.00 zł"}},null,null,"Złożenie (wysłanie) zamówienia oznacza, że Zamawiający akceptuje regulamin, warunki współpracy oraz standardy wykonania obowiązujące w firmie Tommark sp.j.",{"$nulls":73},"RIBS VRC","GR3_Monte Carlo",{"$nulls":14},"YOODA Pilot BESH 1-kanałowy","YOODA BESH 1CH",{"v":82,"d":"82.00 PLN"},{"$nulls":13},"Viper","GR1_Viper","V11",null,null,"Wrangler",4,"GR4_Wrangler"]
[{"$nulls":24},"Arkusz wersja 1.4  obowiązuje od 25.10.2022 do odwołania",{"$nulls":73},"RIBS VRC","GR4_Sebring",{"$nulls":14},"YOODA Pilot BESH  5-kanałowy","YOODA BESH 5CH",{"v":90,"d":"90.00 PLN"},{"$nulls":13},"Viper","GR1_Viper","16",null,null,"Camaro",4,"GR4_Camaro"]
[{"$nulls":98},"RIBS VRC","GR4_DeVille",{"$nulls":14},"YOODA Pilot BESH 15-kanałowy","YOODA BESH 15CH",{"v":142,"d":"142.00 PLN"},{"$nulls":13},"Viper","GR1_Viper","V12",null,null,"Daytona",5,"GR5_Daytona"]
["Pola oznaczone kolorem żółtym należy wypełnić ręcznie wpisując odpowiednią wartość lub opcję",{"$nulls":24},"Wartość pól oznaczonych kolorem pomarańczowym należy wybrać z listy",{"$nulls":72},"RIBS VRC","GR4_Wrangler",{"$nulls":14},"YOODA Pilot BESH 1-kanałowy z programatorem czasowym","YOODA BESH 1CH T",{"v":224,"d":"224.00 PLN"},{"$nulls":13},"Viper","GR1_Viper","17",null,null,"Siber",5,"GR5_Siber"]
[{"$nulls":98},"RIBS VRC","GR4_Camaro",{"$nulls":14},"YOODA Pilot BESH 5-kanałowy z programatorem czasowym","YOODA BESH 5CH T",{"v":251,"d":"251.00 PLN"},{"$nulls":13},"Viper","GR1_Viper","V13",null,null,"Master",2,"GR2_Master"]
[null,"Modele Rolet Rzymskich",{"$nulls":15},"Odległości między sprosami ",{"$nulls":80},"RIBS VRC","GR5_Daytona",{"$nulls":14},"YOODA Pilot BESH 15-kanałowy z programatorem czasowym","YOODA BESH 15CH T",{"v":266,"d":"266.00 PLN"},{"$nulls":13},"Viper","GR1_Viper","18"]
[null,1,"Model 1 Szprosy z przodu",{"$nulls":14},"Minimalnie  19cm",{"$nulls":80},"RIBS VRC","GR5_Siber",{"$nulls":14},"YOODA Pilot SHAKKI 1-kanałowy","YOODA SHAKKI 1CH",{"v":65,"d":"65.00 PLN"},{"$nulls":13},"Viper","GR1_Viper","V14"]
[null,2,"Model 2 Szprosy z tyłu",{"$nulls":14},"Maksymalnie 50cm ",{"$nulls":80},"RIBS VRC","GR2_Master",{"$nulls":14},"YOODA Pilot SHAKKI 5-kanałowy","YOODA SHAKKI 5CH",{"v":82,"d":"82.00 PLN"},{"$nulls":13},"Viper","GR1_Viper","V15"]
[{"$nulls":17},"W przypadku braku zaznaczenia stosowane jest standardowe rozłożenie 25cm",{"$nulls":80},"RIBS VRC",{"$f":"EH41","v":"GR3_Royal Monaco"},{"$nulls":14},"YOODA Pilot SHAKKI 9-kanałowy","YOODA SHAKKI 9CH",{"v":139,"d":"139.00 PLN"},{"$nulls":13},"Viper","GR1_Viper","V16",null,null,"Royal Monaco",3,{"$f":"$EH$6&EG41&\"_\"&EF41","v":"GR3_Royal Monaco"}]
[{"$nulls":98},{"$f":"$CC$12","v":"RIBS VRC"},{"$f":"EH42","v":"GR3_Lincoln"},{"$nulls":14},"YOODA Pilot SHAKKI 15-kanałowy","YOODA SHAKKI 15CH",{"v":140,"d":"140.00 PLN"},{"$nulls":13},"Viper","GR1_Viper","V17",null,null,"Lincoln",3,{"$f":"$EH$6&EG42&\"_\"&EF42","v":"GR3_Lincoln"}]
[{"$nulls":98},"RIBS VRC",{"$f":"EH43","v":"GR3_Sonett"},{"$nulls":14},"YOODA Pilot SHAKKI 1-kanałowy z programatorem czasowym","YOODA SHAKKI 1CH T",{"v":172,"d":"172.00 PLN"},{"$nulls":13},"Viper","GR1_Viper","V18",null,null,"Sonett",3,"GR3_Sonett"]
[{"$nulls":98},"RIBS VRC",{"$f":"EH44","v":"GR6_Challenger"},{"$nulls":14},"YOODA Pilot SHAKKI 15-kanałowy z programatorem czasowym","YOODA SHAKKI 15CH T",{"v":249,"d":"249.00 PLN"},{"$nulls":13},"Viper","GR1_Viper","V19",null,null,"Challenger",6,"GR6_Challenger"]
[null,"Typy Rolet Rzymskich",{"$nulls":96},"RIBS VRC","GR1_RB",{"$nulls":14},"YOODA Pilot MELODY 1-kanałowy","YOODA MELODY 1CH",{"v":70,"d":"70.00 PLN"},{"$nulls":13},"Viper","GR1_Viper","V20",null,null,"RB",1,"GR1_RB"]
[null,"a","Roleta z tkaniną pasowaną od góry",{"$nulls":95},"RIBS VRC","GR1_Ivy",{"$nulls":14},"YOODA Pilot MELODY 5-kanałowy","YOODA MELODY 5CH",{"v":86,"d":"86.00 PLN"},{"$nulls":13},"Viper","GR1_Viper","V21",null,null,"Ivy",1,"GR1_Ivy"]
[null,"b","Równy podział tuneli",{"$nulls":95},"RIBS VRC","GR1_Daisy",{"$nulls":14},"YOODA Pilot MELODY 9-kanałowy","YOODA MELODY 9CH",{"v":152,"d":"152.00 PLN"},{"$nulls":13},"Viper","GR1_Viper","V22",null,null,"Daisy",1,"GR1_Daisy"]
[null,"c","Roleta z tkaniną pasowaną od dołu ",{"$nulls":95},"RIBS VRC","GR1_Allysium",{"$nulls":14},"YOODA Pilot MELODY 15-kanałowy","YOODA MELODY 15CH",{"v":179,"d":"179.00 PLN"},{"$nulls":13},"Viper","GR1_Viper","V23",null,null,"Allysium",1,"GR1_Allysium"]
[null,"d","Falbana ",{"$nulls":95},"RIBS VRC","GR1_Violet",{"$nulls":14},"YOODA Pilot MELODY 1-kanałowy z programatorem czasowym","YOODA MELODY 1CH T",{"v":179,"d":"179.00 PLN"},{"$nulls":13},"Viper","GR1_Viper","19",null,null,"Violet",1,"GR1_Violet"]
[null,"e","Kaskada",{"$nulls":95},"RIBS VRC","GR1_Prado",{"$nulls":14},"YOODA Pilot MELODY 15-kanałowy z programatorem czasowym","YOODA MELODY 15CH T",{"v":312,"d":"312.00 PLN"},{"$nulls":13},"Viper","GR1_Viper","20",null,null,"Prado",1,"GR1_Prado"]
[{"$nulls":98},"RIBS VRC","GR1_Lacosta",{"$nulls":14},"YOODA Pilot VENTO 9-kanałowy","YOODA VENOT 9CH",{"v":160,"d":"160.00 PLN"},{"$nulls":13},"Viper","GR1_Viper","V24",null,null,"Lacosta",1,"GR1_Lacosta"]
[null,"Wykończenie tuneli",{"$nulls":96},"RIBS VRC","GR1_Livello 6",{"$nulls":14},"YOODA Pilot VENTO 15-kanałowy","YOODA VENTO 15CH",{"v":186,"d":"186.00 PLN"},{"$nulls":13},"Viper","GR1_Viper","21",null,null,"Livello 6",1,"GR1_Livello 6"]
[null,"a","Tunele odkryte z dwóch stron",{"$nulls":95},"RIBS VRC","GR1_Livello 7",{"$nulls":14},"YOODA Pilot VENTO 1-kanałowy z programatorem czasowym","YOODA VENTO 1CH T",{"v":188,"d":"188.00 PLN"},{"$nulls":13},"Viper","GR1_Viper","V25",null,null,"Livello 7",1,"GR1_Livello 7"]
[null,"b","Tunele zaszyte z jednej stronny",{"$nulls":95},"RIBS VRC","GR1_Livello 8",{"$nulls":14},"YOODA Pilot VENTO 5-kanałowy z programatorem czasowym","YOODA VENTO 5CH T",{"v":321,"d":"321.00 PLN"},{"$nulls":13},"Viper","GR1_Viper","22",null,null,"Livello 8",1,"GR1_Livello 8"]
[null,"c","Tunele zaszyte z obu stron z oczkiem",{"$nulls":95},"RIBS VRC","GR1_Livello 9",{"$nulls":14},"YOODA Pilot LINEO 1-kanałowy","YOODA LINEO 1CH",{"v":90,"d":"90.00 PLN"},{"$nulls":13},"Viper","GR1_Viper","23",null,null,"Livello 9",1,"GR1_Livello 9"]
[{"$nulls":98},"RIBS VRC","GR1_Livello 10",{"$nulls":14},"YOODA Pilot LINEO 15-kanałowy","YOODA LINEO 15CH",{"v":102,"d":"102.00 PLN"},{"$nulls":13},"Viper","GR1_Viper","24",null,null,"Livello 10",1,"GR1_Livello 10"]
[{"$nulls":98},"RIBS VRC","GR2_Calla",{"$nulls":14},"YOODA Pilot LINEO 1-kanałowy z programatorem czasowym","YOODA LINEO 1CH T",{"v":128,"d":"128.00 PLN"},{"$nulls":13},"Viper","GR1_Viper","25",null,null,"Calla",2,"GR2_Calla"]
[{"$nulls":98},"RIBS VRC","GR2_Rose",{"$nulls":14},"YOODA Pilot LINEO 5-kanałowy z programatorem czasowym","YOODA LINEO 1CH T",{"v":189,"d":"189.00 PLN"},{"$nulls":13},"Viper","GR1_Viper","26",null,null,"Rose",2,"GR2_Rose"]
[null,"Szprosy ",{"$nulls":96},"RIBS VRC","GR2_Lily",{"$nulls":14},"YOODA Pilot GALAXO 2-kanałowy","YOODA GALAXO 2CH",{"v":201,"d":"201.00 PLN"},{"$nulls":13},"Viper","GR1_Viper","27",null,null,"Lily",2,"GR2_Lily"]
[null,"a","Włókno szklane białe 4 mm",{"$nulls":95},"RIBS VRC","GR2_Iris",{"$nulls":14},"YOODA Pilot GALAXO 30-kanałowy","YOODA GALAXO 30CH",{"v":131,"d":"131.00 PLN"},{"$nulls":13},"Viper","GR1_Viper","V26",null,null,"Iris",2,"GR2_Iris"]
[null,"b","Pręt PS transparentny 11 mm",{"$nulls":95},"RIBS VRC","GR2_Peony",{"$nulls":14},"YOODA Pilot GALAXO 30-kanałowy z programatorem czasowym","YOODA GALAXO 30CH T",{"v":260,"d":"260.00 PLN"},{"$nulls":13},"Viper","GR1_Viper","28",null,null,"Peony",2,"GR2_Peony"]
[null,"c","Listwa PS transparentna 5x20 mm",{"$nulls":95},"RIBS VRC","GR2_Holly",{"$nulls":14},"YOODA Pilot ścienny AURA 1-kanałowy","YOODA AURA 1CH",{"v":261,"d":"261.00 PLN"},{"$nulls":13},"Viper","GR1_Viper","29",null,null,"Holly",2,"GR2_Holly"]
[{"$nulls":98},"RIBS VRC","GR2_Naturaleza",{"$nulls":14},"YOODA Pilot ścienny AURA 2-kanałowy","YOODA AURA 2CH",{"v":277,"d":"277.00 PLN"},{"$nulls":13},"Viper","GR1_Viper","V27",null,null,"Naturaleza",2,"GR2_Naturaleza"]
[{"$nulls":98},"RIBS VRC","GR2_Livello 1",{"$nulls":14},"YOODA Pilot ścienny AURA 15-kanałowy","YOODA AURA 15CH",{"v":457,"d":"457.00 PLN"},{"$nulls":13},"Viper","GR1_Viper","V28",null,null,"Livello 1",2,"GR2_Livello 1"]
[{"$nulls":98},"RIBS VRC","GR2_Livello 2",{"$nulls":14},"YOODA Pilot ścienny AURA 1-kanałowy z programatorem czasowym","YOODA AURA 1CH T",{"v":508,"d":"508.00 PLN"},{"$nulls":13},"Viper","GR1_Viper","V29",null,null,"Livello 2",2,"GR2_Livello 2"]
[null,"Mocowanie górne",{"$nulls":96},"RIBS VRC","GR2_Livello 5",{"$nulls":14},"YOODA Pilot ścienny AURA 5-kanałowy z programatorem czasowym","YOODA AURA 5CH T",{"v":613,"d":"613.00 PLN"},{"$nulls":13},"Viper","GR1_Viper","V30",null,null,"Livello 5",2,"GR2_Livello 5"]
[null,"a","Twist stalowy biały, zapinany",{"$nulls":95},"RIBS VRC","GR3_Cherry",{"$nulls":14},"YOODA Pilot ścienny CAMELEO 1-kanałowy","YOODA CAMELEO 1CH",{"v":70.64,"d":"70.64 PLN"},{"$nulls":13},"Viper","GR1_Viper","30",null,null,"Cherry",3,"GR3_Cherry"]
[null,"b","Klips stalowy biały, zatrzaskowy",{"$nulls":95},"RIBS VRC","GR3_Camelia",{"$nulls":14},"YOODA Pilot ścienny CAMELEO 2-kanałowy","YOODA CAMELEO 2CH",{"v":77.26,"d":"77.26 PLN"},{"$nulls":13},"Viper","GR1_Viper","V31",null,null,"Camelia",3,"GR3_Camelia"]
[null,"c","Uchwyt bezinwazyjny z Twistem",{"$nulls":95},"RIBS VRC","GR3_Livello 3",{"$nulls":14},"YOODA Pilot ścienny CAMELEO 15-kanałowy","YOODA CAMELEO 15CH",{"v":109.36,"d":"109.36 PLN"},{"$nulls":13},"Viper","GR1_Viper","V32",null,null,"Livello 3",3,"GR3_Livello 3"]
[null,"d","Uchwyt bezinwazyjny z klipsem",{"$nulls":95},"RIBS VRC","GR3_Livello 4",{"$nulls":14},"YOODA Pilot ścienny CAMELEO 1-kanałowy z programatorem czasowym","YOODA CAMELEO CH1 T",{"v":148.71,"d":"148.71 PLN"},{"$nulls":13},"Viper","GR1_Viper","31",null,null,"Livello 4",3,"GR3_Livello 4"]
[{"$nulls":98},"RIBS VRC","GR4_Jasmine",{"$nulls":14},"YOODA Pilot ścienny CAMELEO 5-kanałowy z programatorem czasowym","YOODA CAMELEO 5CH T",{"v":159.67,"d":"159.67 PLN"},{"$nulls":13},"Viper","GR1_Viper","V33",null,null,"Jasmine",4,"GR4_Jasmine"]
[{"$nulls":98},"RIBS VRC","GR4_Pansy",{"$nulls":14},"YOODA Ramka do pilotów CAMELEO, beige","YOODA RAMKA CAMELEO",{"v":18.3,"d":"18.30 PLN"},{"$nulls":13},"Viper",{"$f":"VLOOKUP(EA72,$EF$7:$EH$72,3,0)","v":"GR1_Viper"},"32",null,null,"Pansy",4,"GR4_Pansy"]
[null,"Sterowanie w Roletach Rzymskich",{"$nulls":8},"Ilość zaczepów ",{"$nulls":5},"Kody błedów pojawiające się na arkuszu",{"$nulls":81},{"$f":"$CC$9","v":"Classic VRC"},{"$f":"EH7","v":"GR1_Viper"},{"$nulls":14},"YOODA Pilot ścienny MAGNETIC DELUXE 1-kanałowy","YOODA MAGNETIC DELUXE 1CH",{"v":131,"d":"131.00 PLN"},{"$nulls":13},"Viper","GR1_Viper","33"]
[null,"CP","Łańcuszkowe Prawe",{"$nulls":7},"szerokość",null,"liczba twistów",{"$nulls":85},{"$f":"$CC$9","v":"Classic VRC"},"GR1_Levante",{"$nulls":14},"YOODA Pilot ścienny MAGNETIC DELUXE 2-kanałowy","YOODA MAGNETIC DELUXE 2CH",{"v":152,"d":"152.00 PLN"},{"$nulls":13},"Viper","GR1_Viper","34"]
[null,"CL","Łańcuszkowe Lewe",{"$nulls":7},"0-69",null,2,{"$nulls":3},"!BŁĄD 001!",{"$nulls":4},"Roleta przekracza  maksymalny wymiar paczki kurierskiej,skontaktuj się z handlowcem",{"$nulls":76},"Classic VRC","GR1_Astra",{"$nulls":14},"YOODA Pilot ścienny MAGNETIC DELUXE 15-kanałowy","YOODA MAGNETIC DELUXE 15CH",{"v":267,"d":"267.00 PLN"},{"$nulls":13},"Viper","GR1_Viper","35"]
[null,"EY","Elektryczne YOODA",{"$nulls":7},"70-119",null,3,{"$nulls":85},"Classic VRC","GR1_Italia",{"$nulls":14},"YOODA Pilot ścienny MAGNETIC DELUXE 1-kanałowy z programatorem czasowym","YOODA  MAGNETIC DELUXE 1CH T",{"v":268,"d":"268.00 PLN"},{"$nulls":13},"Viper","GR1_Viper","V34"]
[null,"ES","Elektryczne SOMFY",{"$nulls":7},"120-169",null,4,{"$nulls":3},"!BŁĄD 002!",{"$nulls":4},"Szerokość przekracza wymiar maksymalny w celu wyceny skontaktuj się z handlowcem",{"$nulls":76},"Classic VRC","GR1_Carrera",{"$nulls":14},"YOODA Pilot ścienny MAGNETIC DELUXE 5-kanałowy z programatorem czasowym","YOODA MAGNETIC DELUXE 5CH T",{"v":297,"d":"297.00 PLN"},{"$nulls":13},"Viper","GR1_Viper","V35"]
[null,"EM","Elektryczne MOTION",{"$nulls":7},"170-219",null,5,{"$nulls":85},"Classic VRC","GR1_Cayenne",{"$nulls":14},"YOODA Pilot ścienny MAGNETIC 1-kanałowy","YOODA MAGNETIC  1CH",{"v":107,"d":"107.00 PLN"},{"$nulls":13},"Levante","GR1_Levante","  V01"]
[{"$nulls":10},"220-269",null,6,{"$nulls":3},"!BŁĄD 003!",{"$nulls":4},"Wysokość przekracza wymiar maksymalny, w celu wyceny skontaktuj się z handlowcem",{"$nulls":76},"Classic VRC","GR1_Macan",{"$nulls":14},"YOODA Pilot ścienny MAGNETIC 2-kanałowy","YOODA MAGNETIC 2CH",{"v":118,"d":"118.00 PLN"},{"$nulls":13},"Levante","GR1_Levante","  V02"]
[{"$nulls":10},">270",null,7,{"$nulls":85},"Classic VRC","GR2_Veyron",{"$nulls":14},"YOODA Pilot ścienny MAGNETIC 15-kanałowy","YOODA MAGNETIC 15CH",{"v":204,"d":"204.00 PLN"},{"$nulls":13},"Levante","GR1_Levante","  V03"]
[{"$nulls":98},"Classic VRC","GR2_Huracan",{"$nulls":14},"YOODA Pilot ścienny MAGNETIC 1-kanałowy z programatorem czasowym","YOODA MAGNETIC 1CH T",{"v":202,"d":"202.00 PLN"},{"$nulls":13},"Levante","GR1_Levante"," 01"]
[{"$nulls":98},"Classic VRC","GR2_Vogue",{"$nulls":14},"YOODA Pilot ścienny MAGNETIC 5-kanałowy z programatorem czasowym","YOODA MAGNETIC 5CH T",{"v":229,"d":"229.00 PLN"},{"$nulls":13},"Levante","GR1_Levante"," V04"]
[null,"Pion",{"$nulls":6},"Poziom",{"$nulls":89},"Classic VRC","GR3_Continental",{"$nulls":14},"YOODA Pilot ścienny NUXO 2-kanałowy, biały","YOODA NUXO 2CH",{"v":163,"d":"163.00 PLN"},{"$nulls":13},"Levante","GR1_Levante"," 02"]
[{"$nulls":98},"Classic VRC","GR3_Pathfinder",{"$nulls":14},"YOODA Pilot ścienny NUXO 1-kanałowy","YOODA NUXO 1CH",{"v":153,"d":"153.00 PLN"},{"$nulls":13},"Levante","GR1_Levante"," V05"]
[{"$nulls":98},"Classic VRC","GR6_Aventador",{"$nulls":14},"YOODA Pilot ścienny NUXO 15-kanałowy","YOODA NUXO 15CH",{"v":279,"d":"279.00 PLN"},{"$nulls":13},"Levante","GR1_Levante"," 03"]
[{"$nulls":98},"Classic VRC","GR1_Testarossa",{"$nulls":14},"YOODA Pilot ścienny NUXO 5-kanałowy z programatorem czasowym","YOODA NUXO 5CH T",{"v":309,"d":"309.00 PLN"},{"$nulls":13},"Levante","GR1_Levante"," 04"]
[{"$nulls":98},"Classic VRC","GR3_Nestor",{"$nulls":14},"YOODA Czujnik słońca SOLEO, bezprzewodowy","YOODA SOLEO",{"v":214,"d":"214.00 PLN"},{"$nulls":13},"Levante","GR1_Levante"," 05"]
[{"$nulls":98},"Classic VRC",{"$f":"EH23","v":"GR3_Mustang"},{"$nulls":14},"YOODA Sterownik Smart Controll","YOODA YOODA Smart Controll",{"v":700,"d":"700.00 PLN"},{"$nulls":13},"Levante","GR1_Levante"," 06"]
[{"$nulls":98},"Classic VRC","GR3_Beetle",{"$nulls":14},"MOTION - CM11 pilot 1 CH ","MOTION CM11 1CH",{"v":70,"d":"70.00 PLN"},{"$nulls":13},"Levante","GR1_Levante"," 07"]
[{"$nulls":98},"Classic VRC","GR3_Mistral",{"$nulls":14},"MOTION - CM12 Pilot 5 CH","MOTION CM12 5CH",{"v":90,"d":"90.00 PLN"},{"$nulls":13},"Levante","GR1_Levante"," V06"]
[{"$nulls":98},"Classic VRC","GR3_Phantom",{"$nulls":14},"MOTION - CM13 pilot 15 CH","MOTION CM13 15CH",{"v":120,"d":"120.00 PLN"},{"$nulls":13},"Levante","GR1_Levante"," V07"]
[{"$nulls":98},"Classic VRC","GR3_Ghost",{"$nulls":14},"MOTION CM-18 pilot 1CH (pociągany)","MOTION CM18 1CH",{"v":60,"d":"60.00 PLN"},{"$nulls":13},"Levante","GR1_Levante"," 08"]
[{"$nulls":98},"Classic VRC","GR3_Corniche",{"$nulls":14},"MOTION-CM-17 pilot 4 CH (stołowy)","MOTION CM17 4CH",{"v":150,"d":"150.00 PLN"},{"$nulls":13},"Levante","GR1_Levante"," V08"]
[{"$nulls":98},"Classic VRC","GR4_Leopard",{"$nulls":14},"MOTION CM-16 pilot 4CH","MOTION CM16 4CH",{"v":290,"d":"290.00 PLN"},{"$nulls":13},"Levante","GR1_Levante"," 09"]
[{"$nulls":98},"Classic VRC","GR3_Monte Carlo",{"$nulls":14},"MOTION CM-20  Smart Home  ","MOTION CM20 SMART HOME",{"v":470,"d":"470.00 PLN"},{"$nulls":13},"Levante","GR1_Levante"," V09"]
[null,"Grafiki przedstawiające sposób cięcia i szycia tkaniny względem wysokości gotowej rolety rzymskiej",{"$nulls":96},"Classic VRC","GR4_Sebring",{"$nulls":14},"SOMFY Pilot 1-kanałowy Telis 1","SOMFY TELIS 1CH",{"v":90,"d":"90.00 PLN"},{"$nulls":13},"Levante","GR1_Levante"," 10"]
[{"$nulls":98},"Classic VRC","GR4_DeVille",{"$nulls":14},"SOMFY Pilot 4-kanałowy Telis 4","SOMFY TELIS 4CH",{"v":250,"d":"250.00 PLN"},{"$nulls":13},"Levante","GR1_Levante"," 11"]
[{"$nulls":98},"Classic VRC","GR4_Wrangler",{"$nulls":14},"SOMFY Pilot 4-kanałowy Telis 4 Mod/Var z rolką","SOMFY TELIS 4 MOD/VAR Z ROLKĄ 4CH",{"v":310,"d":"310.00 PLN"},{"$nulls":13},"Levante","GR1_Levante"," V10"]
[{"$nulls":98},"Classic VRC","GR4_Camaro",{"$nulls":14},"SOMFY TAHOMA","TAHOMA centrala sterująca",{"v":1000,"d":"1,000.00 PLN"},{"$nulls":13},"Levante","GR1_Levante"," 12"]
[{"$nulls":98},"Classic VRC","GR5_Daytona",{"$nulls":30},"Levante","GR1_Levante"," V11"]
[{"$nulls":98},"Classic VRC","GR5_Siber",{"$nulls":30},"Levante","GR1_Levante"," 13"]
[{"$nulls":98},"Classic VRC","GR2_Master",{"$nulls":30},"Levante","GR1_Levante"," 14"]
[{"$nulls":98},"Classic VRC",{"$f":"EH41","v":"GR3_Royal Monaco"},{"$nulls":30},"Levante","GR1_Levante"," 15"]
[{"$nulls":98},"Classic VRC",{"$f":"EH42","v":"GR3_Lincoln"},{"$nulls":30},"Levante","GR1_Levante"," V12"]
[{"$nulls":98},"Classic VRC",{"$f":"EH43","v":"GR3_Sonett"},{"$nulls":30},"Levante","GR1_Levante"," V13"]
[{"$nulls":98},"Classic VRC",{"$f":"EH44","v":"GR6_Challenger"},{"$nulls":30},"Levante","GR1_Levante"," 16"]
[{"$nulls":98},{"$f":"$CC$11","v":"TKANINA"},{"$f":"EH7","v":"GR1_Viper"},{"$nulls":30},"Levante","GR1_Levante"," 17"]
[{"$nulls":98},"TKANINA","GR1_Levante",{"$nulls":30},"Levante","GR1_Levante"," 18"]
[{"$nulls":98},"TKANINA","GR1_Astra",{"$nulls":30},"Levante","GR1_Levante"," V14"]
[{"$nulls":98},"TKANINA","GR1_Italia",{"$nulls":30},"Levante","GR1_Levante"," 19"]
[{"$nulls":98},"TKANINA","GR1_Carrera",{"$nulls":30},"Levante","GR1_Levante"," V15"]
[{"$nulls":98},"TKANINA","GR1_Cayenne","Classic VRC","GR1_RB",{"$nulls":28},"Levante","GR1_Levante"," 20"]
[{"$nulls":98},"TKANINA","GR1_Macan","Classic VRC","GR1_Ivy",{"$nulls":28},"Levante","GR1_Levante"," 21"]
[{"$nulls":98},"TKANINA","GR2_Veyron","Classic VRC","GR1_Daisy",{"$nulls":28},"Levante","GR1_Levante"," V16"]
[{"$nulls":98},"TKANINA","GR2_Huracan","Classic VRC","GR1_Allysium",{"$nulls":28},"Levante","GR1_Levante"," 22"]
[{"$nulls":98},"TKANINA","GR2_Vogue","Classic VRC","GR1_Violet",{"$nulls":28},"Levante","GR1_Levante"," 23"]
[{"$nulls":98},"TKANINA","GR3_Continental","Classic VRC","GR1_Prado",{"$nulls":28},"Levante","GR1_Levante"," 24"]
[{"$nulls":98},"TKANINA","GR3_Pathfinder","Classic VRC","GR1_Lacosta",{"$nulls":28},"Astra","GR1_Astra","01"]
[{"$nulls":98},"TKANINA","GR6_Aventador","Classic VRC","GR1_Livello 6",{"$nulls":28},"Astra","GR1_Astra","02"]
[{"$nulls":98},"TKANINA","GR1_Testarossa","Classic VRC","GR1_Livello 7",{"$nulls":28},"Astra","GR1_Astra","03"]
[{"$nulls":98},"TKANINA","GR3_Nestor","Classic VRC","GR1_Livello 8",{"$nulls":28},"Astra","GR1_Astra","04"]
[{"$nulls":98},"TKANINA",{"$f":"EH23","v":"GR3_Mustang"},"Classic VRC","GR1_Livello 9",{"$nulls":28},"Italia","GR1_Italia"," 01"]
[{"$nulls":98},"TKANINA","GR3_Beetle","Classic VRC","GR1_Livello 10",{"$nulls":28},"Italia","GR1_Italia"," 03"]
[{"$nulls":98},"TKANINA","GR3_Mistral","Classic VRC","GR2_Calla",{"$nulls":28},"Italia","GR1_Italia"," 02"]
[{"$nulls":98},"TKANINA","GR3_Phantom","Classic VRC","GR2_Rose",{"$nulls":28},"Carrera","GR1_Carrera"," 01"]
[{"$nulls":98},"TKANINA","GR3_Ghost","Classic VRC","GR2_Lily",{"$nulls":28},"Carrera","GR1_Carrera"," 02"]
[{"$nulls":98},"TKANINA","GR3_Corniche","Classic VRC","GR2_Iris",{"$nulls":28},"Carrera","GR1_Carrera"," 03"]
[{"$nulls":98},"TKANINA","GR4_Leopard","Classic VRC","GR2_Peony",{"$nulls":28},"Carrera","GR1_Carrera"," 04"]
[{"$nulls":98},"TKANINA","GR3_Monte Carlo","Classic VRC","GR2_Holly",{"$nulls":28},"Carrera","GR1_Carrera"," 05"]
[{"$nulls":98},"TKANINA","GR4_Sebring","Classic VRC","GR2_Naturaleza",{"$nulls":28},"Macan","GR1_Macan","01"]
[{"$nulls":98},"TKANINA","GR4_DeVille","Classic VRC","GR2_Livello 1",{"$nulls":28},"Macan","GR1_Macan","02"]
[{"$nulls":98},"TKANINA","GR4_Wrangler","Classic VRC","GR2_Livello 2",{"$nulls":28},"Macan","GR1_Macan","03"]
[{"$nulls":98},"TKANINA","GR4_Camaro","Classic VRC","GR2_Livello 5",{"$nulls":28},"Macan","GR1_Macan","04"]
[{"$nulls":98},"TKANINA","GR5_Daytona","Classic VRC","GR3_Cherry",{"$nulls":28},"Macan","GR1_Macan","05"]
[{"$nulls":98},"TKANINA","GR5_Siber","Classic VRC","GR3_Camelia",{"$nulls":28},"Cayenne","GR1_Cayenne","01"]
[{"$nulls":98},"TKANINA","GR2_Master","Classic VRC","GR3_Livello 3",{"$nulls":28},"Cayenne",{"$f":"VLOOKUP(EA136,$EF$7:$EH$72,3,0)","v":"GR1_Cayenne"},"02"]
[{"$nulls":98},"TKANINA",{"$f":"EH41","v":"GR3_Royal Monaco"},"Classic VRC","GR3_Livello 4",{"$nulls":28},"Cayenne","GR1_Cayenne","03"]
[{"$nulls":98},"TKANINA",{"$f":"EH42","v":"GR3_Lincoln"},"Classic VRC","GR4_Jasmine",{"$nulls":28},"Cayenne","GR1_Cayenne","04"]
[{"$nulls":98},"TKANINA",{"$f":"EH43","v":"GR3_Sonett"},"Classic VRC","GR4_Pansy",{"$nulls":28},"Cayenne","GR1_Cayenne","05"]
[{"$nulls":98},"TKANINA",{"$f":"EH44","v":"GR6_Challenger"},{"$nulls":30},"Veyron","GR2_Veyron"," V01"]
[{"$nulls":98},{"$f":"CC10","v":"KARNISZ VRC"},"Tylko_karnisz",{"$nulls":30},"Veyron","GR2_Veyron"," V02"]
[{"$nulls":130},"Veyron","GR2_Veyron"," 01"]
[{"$nulls":130},"Veyron","GR2_Veyron"," V03"]
[{"$nulls":130},"Veyron","GR2_Veyron"," V04"]
[{"$nulls":130},"Veyron","GR2_Veyron"," V05"]
[{"$nulls":130},"Veyron","GR2_Veyron"," 02"]
[{"$nulls":130},"Veyron","GR2_Veyron"," V06"]
[{"$nulls":130},"Veyron","GR2_Veyron"," 03"]
[{"$nulls":130},"Veyron","GR2_Veyron"," V07"]
[{"$nulls":130},"Veyron","GR2_Veyron"," 04"]
[{"$nulls":130},"Veyron","GR2_Veyron"," V08"]
[{"$nulls":130},"Veyron","GR2_Veyron"," 05"]
[{"$nulls":130},"Veyron","GR2_Veyron"," 06"]
[{"$nulls":130},"Veyron","GR2_Veyron"," 07"]
[{"$nulls":130},"Veyron","GR2_Veyron"," V09"]
[{"$nulls":130},"Veyron","GR2_Veyron"," V10"]
[{"$nulls":130},"Veyron","GR2_Veyron"," 08"]
[{"$nulls":130},"Veyron","GR2_Veyron"," 09"]
[{"$nulls":130},"Veyron","GR2_Veyron"," 10"]
[{"$nulls":130},"Veyron","GR2_Veyron"," 11"]
[{"$nulls":130},"Veyron","GR2_Veyron"," 12"]
[{"$nulls":130},"Veyron","GR2_Veyron"," 13"]
[{"$nulls":130},"Veyron","GR2_Veyron"," V11"]
[{"$nulls":130},"Veyron","GR2_Veyron"," 14"]
[{"$nulls":130},"Veyron","GR2_Veyron"," V12"]
[{"$nulls":130},"Veyron","GR2_Veyron"," V13"]
[{"$nulls":130},"Veyron","GR2_Veyron"," V14"]
[{"$nulls":130},"Veyron","GR2_Veyron"," V15"]
[{"$nulls":130},"Veyron","GR2_Veyron"," V16"]
[{"$nulls":130},"Veyron","GR2_Veyron"," V17"]
[{"$nulls":130},"Veyron","GR2_Veyron"," V18"]
[{"$nulls":130},"Veyron","GR2_Veyron"," V19"]
[{"$nulls":130},"Veyron","GR2_Veyron"," 15"]
[{"$nulls":130},"Veyron","GR2_Veyron"," V20"]
[{"$nulls":100},{"$f":"$CC$11","v":"TKANINA"},"GR1_RB",{"$nulls":28},"Veyron","GR2_Veyron"," 16"]
[{"$nulls":100},"TKANINA","GR1_Ivy",{"$nulls":28},"Veyron","GR2_Veyron"," V21"]
[{"$nulls":100},"TKANINA","GR1_Daisy",{"$nulls":28},"Veyron","GR2_Veyron"," V22"]
[{"$nulls":100},"TKANINA","GR1_Allysium",{"$nulls":28},"Veyron","GR2_Veyron"," V23"]
[{"$nulls":100},"TKANINA","GR1_Violet",{"$nulls":28},"Veyron","GR2_Veyron"," V24"]
[{"$nulls":100},"TKANINA","GR1_Prado",{"$nulls":28},"Veyron","GR2_Veyron"," V25"]
[{"$nulls":100},"TKANINA","GR1_Lacosta",{"$nulls":28},"Veyron","GR2_Veyron"," V26"]
[{"$nulls":100},"TKANINA","GR1_Livello 6",{"$nulls":28},"Veyron","GR2_Veyron"," V27"]
[{"$nulls":100},"TKANINA","GR1_Livello 7",{"$nulls":28},"Veyron","GR2_Veyron"," V28"]
[{"$nulls":100},"TKANINA","GR1_Livello 8",{"$nulls":28},"Veyron","GR2_Veyron"," 17"]
[{"$nulls":100},"TKANINA","GR1_Livello 9",{"$nulls":28},"Veyron","GR2_Veyron"," V29"]
[{"$nulls":100},"TKANINA","GR1_Livello 10",{"$nulls":28},"Veyron","GR2_Veyron"," 18"]
[{"$nulls":100},"TKANINA","GR2_Calla",{"$nulls":28},"Veyron","GR2_Veyron"," V30"]
[{"$nulls":100},"TKANINA","GR2_Rose",{"$nulls":28},"Veyron","GR2_Veyron"," V31"]
[{"$nulls":100},"TKANINA","GR2_Lily",{"$nulls":28},"Veyron","GR2_Veyron"," V32"]
[{"$nulls":100},"TKANINA","GR2_Iris",{"$nulls":28},"Veyron","GR2_Veyron"," V33"]
[{"$nulls":100},"TKANINA","GR2_Peony",{"$nulls":28},"Veyron","GR2_Veyron"," V34"]
[{"$nulls":100},"TKANINA","GR2_Holly",{"$nulls":28},"Veyron","GR2_Veyron"," V35"]
[{"$nulls":100},"TKANINA","GR2_Naturaleza",{"$nulls":28},"Huracan","GR2_Huracan","01"]
[{"$nulls":100},"TKANINA","GR2_Livello 1",{"$nulls":28},"Huracan","GR2_Huracan","02"]
[{"$nulls":100},"TKANINA","GR2_Livello 2",{"$nulls":28},"Huracan","GR2_Huracan","03"]
[{"$nulls":100},"TKANINA","GR2_Livello 5",{"$nulls":28},"Huracan","GR2_Huracan","04"]
[{"$nulls":100},"TKANINA","GR3_Cherry",{"$nulls":28},"Huracan","GR2_Huracan","05"]
[{"$nulls":100},"TKANINA","GR3_Camelia",{"$nulls":28},"Huracan","GR2_Huracan","06"]
[{"$nulls":100},"TKANINA","GR3_Livello 3",{"$nulls":28},"Huracan","GR2_Huracan","07"]
[{"$nulls":100},"TKANINA","GR3_Livello 4",{"$nulls":28},"Huracan",{"$f":"VLOOKUP(EA200,$EF$7:$EH$72,3,0)","v":"GR2_Huracan"},"08"]
[{"$nulls":100},"TKANINA","GR4_Jasmine",{"$nulls":28},"Huracan","GR2_Huracan","09"]
[{"$nulls":100},"TKANINA","GR4_Pansy",{"$nulls":28},"Huracan","GR2_Huracan","10"]
[{"$nulls":130},"Huracan","GR2_Huracan","11"]
[{"$nulls":130},"Huracan","GR2_Huracan","12"]
[{"$nulls":130},"Huracan","GR2_Huracan","V01"]
[{"$nulls":130},"Huracan","GR2_Huracan","V02"]
[{"$nulls":130},"Huracan","GR2_Huracan","13"]
[{"$nulls":130},"Huracan","GR2_Huracan","14"]
[{"$nulls":130},"Huracan","GR2_Huracan","V03"]
[{"$nulls":130},"Huracan","GR2_Huracan","15"]
[{"$nulls":130},"Huracan","GR2_Huracan","16"]
[{"$nulls":130},"Huracan","GR2_Huracan","17"]
[{"$nulls":130},"Huracan","GR2_Huracan","18"]
[{"$nulls":130},"Vogue","GR2_Vogue","01"]
[{"$nulls":130},"Vogue","GR2_Vogue","02"]
[{"$nulls":130},"Vogue","GR2_Vogue","03"]
[{"$nulls":130},"Vogue","GR2_Vogue","04"]
[{"$nulls":130},"Vogue","GR2_Vogue","V01"]
[{"$nulls":130},"Vogue","GR2_Vogue","05"]
[{"$nulls":130},"Vogue","GR2_Vogue","06"]
[{"$nulls":130},"Vogue","GR2_Vogue","07"]
[{"$nulls":130},"Vogue","GR2_Vogue","08"]
[{"$nulls":130},"Vogue","GR2_Vogue","09"]
[{"$nulls":130},"Continental","GR3_Continental"," 01"]
[{"$nulls":130},"Continental","GR3_Continental"," 02"]
[{"$nulls":130},"Continental","GR3_Continental"," 03"]
[{"$nulls":130},"Continental","GR3_Continental"," 04"]
[{"$nulls":130},"Continental","GR3_Continental"," 05"]
[{"$nulls":130},"Continental","GR3_Continental"," 06"]
[{"$nulls":130},"Continental","GR3_Continental"," 07"]
[{"$nulls":130},"Continental","GR3_Continental"," 08"]
[{"$nulls":130},"Continental","GR3_Continental"," 09"]
[{"$nulls":130},"Continental","GR3_Continental"," 10"]
[{"$nulls":130},"Continental","GR3_Continental"," 11"]
[{"$nulls":130},"Continental","GR3_Continental"," 12"]
[{"$nulls":130},"Continental","GR3_Continental"," 13"]
[{"$nulls":130},"Continental","GR3_Continental"," 14"]
[{"$nulls":130},"Continental","GR3_Continental"," 15"]
[{"$nulls":130},"Continental","GR3_Continental"," 16"]
[{"$nulls":130},"Continental","GR3_Continental"," 17"]
[{"$nulls":130},"Continental","GR3_Continental"," V01"]
[{"$nulls":130},"Continental","GR3_Continental"," V02"]
[{"$nulls":130},"Continental","GR3_Continental"," 18"]
[{"$nulls":130},"Continental","GR3_Continental"," 19"]
[{"$nulls":130},"Continental","GR3_Continental"," 20"]
[{"$nulls":130},"Continental","GR3_Continental"," 21"]
[{"$nulls":130},"Continental","GR3_Continental"," 22"]
[{"$nulls":130},"Continental","GR3_Continental"," 23"]
[{"$nulls":130},"Pathfinder","GR3_Pathfinder","01"]
[{"$nulls":130},"Pathfinder","GR3_Pathfinder","02"]
[{"$nulls":130},"Pathfinder","GR3_Pathfinder","03"]
[{"$nulls":130},"Pathfinder","GR3_Pathfinder","V01"]
[{"$nulls":130},"Pathfinder","GR3_Pathfinder","04"]
[{"$nulls":130},"Pathfinder","GR3_Pathfinder","05"]
[{"$nulls":130},"Pathfinder","GR3_Pathfinder","06"]
[{"$nulls":130},"Pathfinder","GR3_Pathfinder","08"]
[{"$nulls":130},"Pathfinder","GR3_Pathfinder","07"]
[{"$nulls":130},"Aventador","GR6_Aventador","01"]
[{"$nulls":130},"Aventador","GR6_Aventador","02"]
[{"$nulls":130},"Aventador","GR6_Aventador","03"]
[{"$nulls":130},"Aventador","GR6_Aventador","04"]
[{"$nulls":130},"Aventador","GR6_Aventador","V01"]
[{"$nulls":130},"Aventador","GR6_Aventador","V02"]
[{"$nulls":130},"Aventador",{"$f":"VLOOKUP(EA264,$EF$7:$EH$72,3,0)","v":"GR6_Aventador"},"V03"]
[{"$nulls":130},"Aventador","GR6_Aventador","05"]
[{"$nulls":130},"Aventador","GR6_Aventador","V04"]
[{"$nulls":130},"Aventador","GR6_Aventador","06"]
[{"$nulls":130},"Aventador","GR6_Aventador","07"]
[{"$nulls":130},"Aventador","GR6_Aventador","08"]
[{"$nulls":130},"Aventador","GR6_Aventador","09"]
[{"$nulls":130},"Aventador","GR6_Aventador","10"]
[{"$nulls":130},"Aventador","GR6_Aventador","11"]
[{"$nulls":130},"Aventador","GR6_Aventador","V05"]
[{"$nulls":130},"Aventador","GR6_Aventador","12"]
[{"$nulls":130},"Aventador","GR6_Aventador","13"]
[{"$nulls":130},"Aventador","GR6_Aventador","14"]
[{"$nulls":130},"Aventador","GR6_Aventador","15"]
[{"$nulls":130},"Aventador","GR6_Aventador","16"]
[{"$nulls":130},"Aventador","GR6_Aventador","17"]
[{"$nulls":130},"Aventador","GR6_Aventador","18"]
[{"$nulls":130},"Aventador","GR6_Aventador","19"]
[{"$nulls":130},"Aventador","GR6_Aventador","20"]
[{"$nulls":130},"Aventador","GR6_Aventador","V06"]
[{"$nulls":130},"Aventador","GR6_Aventador","21"]
[{"$nulls":130},"Aventador","GR6_Aventador","22"]
[{"$nulls":130},"Aventador","GR6_Aventador","V07"]
[{"$nulls":130},"Aventador","GR6_Aventador","23"]
[{"$nulls":130},"Aventador","GR6_Aventador","V08"]
[{"$nulls":130},"Aventador","GR6_Aventador","24"]
[{"$nulls":130},"Aventador","GR6_Aventador","V09"]
[{"$nulls":130},"Testarossa","GR1_Testarossa","V01"]
[{"$nulls":130},"Testarossa","GR1_Testarossa","01"]
[{"$nulls":130},"Testarossa","GR1_Testarossa","V02"]
[{"$nulls":130},"Testarossa","GR1_Testarossa","V03"]
[{"$nulls":130},"Testarossa","GR1_Testarossa","V04"]
[{"$nulls":130},"Testarossa","GR1_Testarossa","02"]
[{"$nulls":130},"Testarossa","GR1_Testarossa","03"]
[{"$nulls":130},"Testarossa","GR1_Testarossa","04"]
[{"$nulls":130},"Testarossa","GR1_Testarossa","V05"]
[{"$nulls":130},"Testarossa","GR1_Testarossa","V06"]
[{"$nulls":130},"Testarossa","GR1_Testarossa","V07"]
[{"$nulls":130},"Testarossa","GR1_Testarossa","05"]
[{"$nulls":130},"Testarossa","GR1_Testarossa","06"]
[{"$nulls":130},"Testarossa","GR1_Testarossa","07"]
[{"$nulls":130},"Testarossa","GR1_Testarossa","08"]
[{"$nulls":130},"Testarossa","GR1_Testarossa","09"]
[{"$nulls":130},"Testarossa","GR1_Testarossa","10"]
[{"$nulls":130},"Testarossa","GR1_Testarossa","11"]
[{"$nulls":130},"Testarossa","GR1_Testarossa","12"]
[{"$nulls":130},"Testarossa","GR1_Testarossa","V08"]
[{"$nulls":130},"Testarossa","GR1_Testarossa","V09"]
[{"$nulls":130},"Testarossa","GR1_Testarossa","13"]
[{"$nulls":130},"Testarossa","GR1_Testarossa","V10"]
[{"$nulls":130},"Testarossa","GR1_Testarossa","V11"]
[{"$nulls":130},"Testarossa","GR1_Testarossa","14"]
[{"$nulls":130},"Testarossa","GR1_Testarossa","15"]
[{"$nulls":130},"Testarossa","GR1_Testarossa"," 16"]
[{"$nulls":130},"Testarossa","GR1_Testarossa","17"]
[{"$nulls":130},"Nestor","GR3_Nestor"," 01"]
[{"$nulls":130},"Nestor","GR3_Nestor"," 02"]
[{"$nulls":130},"Nestor","GR3_Nestor"," V01"]
[{"$nulls":130},"Nestor","GR3_Nestor"," 03"]
[{"$nulls":130},"Nestor","GR3_Nestor"," V02"]
[{"$nulls":130},"Nestor","GR3_Nestor"," 04"]
[{"$nulls":130},"Nestor","GR3_Nestor"," V03"]
[{"$nulls":130},"Nestor","GR3_Nestor"," V04"]
[{"$nulls":130},"Nestor","GR3_Nestor"," V05"]
[{"$nulls":130},"Nestor",{"$f":"VLOOKUP(EA328,$EF$7:$EH$72,3,0)","v":"GR3_Nestor"}," V06"]
[{"$nulls":130},"Nestor","GR3_Nestor"," V07"]
[{"$nulls":130},"Nestor","GR3_Nestor"," V08"]
[{"$nulls":130},"Nestor","GR3_Nestor"," 05"]
[{"$nulls":130},"Nestor","GR3_Nestor"," V09"]
[{"$nulls":130},"Nestor","GR3_Nestor"," V10"]
[{"$nulls":130},"Niva","GR3_Niva","01"]
[{"$nulls":130},"Niva","GR3_Niva","02"]
[{"$nulls":130},"Niva","GR3_Niva","V01"]
[{"$nulls":130},"Niva","GR3_Niva","03"]
[{"$nulls":130},"Niva","GR3_Niva","04"]
[{"$nulls":130},"Niva","GR3_Niva","V02"]
[{"$nulls":130},"Niva","GR3_Niva","05"]
[{"$nulls":130},"Niva","GR3_Niva","06"]
[{"$nulls":130},"Niva","GR3_Niva","V03"]
[{"$nulls":130},"Niva","GR3_Niva","V04"]
[{"$nulls":130},"Niva","GR3_Niva","V05"]
[{"$nulls":130},"Niva","GR3_Niva","07"]
[{"$nulls":130},"Niva","GR3_Niva","08"]
[{"$nulls":130},"Niva","GR3_Niva","09"]
[{"$nulls":130},"Niva","GR3_Niva","V10"]
[{"$nulls":130},"Niva","GR3_Niva","10"]
[{"$nulls":130},"Niva","GR3_Niva","11"]
[{"$nulls":130},"Niva","GR3_Niva","V11"]
[{"$nulls":130},"Niva","GR3_Niva","V12"]
[{"$nulls":130},"Niva","GR3_Niva","V13"]
[{"$nulls":130},"Niva","GR3_Niva","V14"]
[{"$nulls":130},"Niva","GR3_Niva","12"]
[{"$nulls":130},"Niva","GR3_Niva","13"]
[{"$nulls":130},"Niva","GR3_Niva","V15"]
[{"$nulls":130},"Niva","GR3_Niva","V16"]
[{"$nulls":130},"Niva","GR3_Niva","V17"]
[{"$nulls":130},"Niva","GR3_Niva","V18"]
[{"$nulls":130},"Niva","GR3_Niva","14"]
[{"$nulls":130},"Niva","GR3_Niva","15"]
[{"$nulls":130},"Niva","GR3_Niva","V19"]
[{"$nulls":130},"Niva","GR3_Niva","V20"]
[{"$nulls":130},"Niva","GR3_Niva","V21"]
[{"$nulls":130},"Niva","GR3_Niva","V22"]
[{"$nulls":130},"Niva","GR3_Niva","V23"]
[{"$nulls":130},"Niva","GR3_Niva","V24"]
[{"$nulls":130},"Niva","GR3_Niva","V25"]
[{"$nulls":130},"Niva","GR3_Niva","V26"]
[{"$nulls":130},"Niva","GR3_Niva","V27"]
[{"$nulls":130},"Niva","GR3_Niva","V28"]
[{"$nulls":130},"Niva","GR3_Niva","V29"]
[{"$nulls":130},"Niva","GR3_Niva","V30"]
[{"$nulls":130},"Niva","GR3_Niva","16"]
[{"$nulls":130},"Niva","GR3_Niva","17"]
[{"$nulls":130},"Niva","GR3_Niva","V31"]
[{"$nulls":130},"Niva","GR3_Niva","V32"]
[{"$nulls":130},"Mustang","GR3_Mustang","V01"]
[{"$nulls":130},"Mustang","GR3_Mustang","01"]
[{"$nulls":130},"Mustang","GR3_Mustang","V02"]
[{"$nulls":130},"Mustang","GR3_Mustang","02"]
[{"$nulls":130},"Mustang","GR3_Mustang","03"]
[{"$nulls":130},"Mustang","GR3_Mustang","V03"]
[{"$nulls":130},"Mustang","GR3_Mustang","04"]
[{"$nulls":130},"Beetle","GR3_Beetle","01"]
[{"$nulls":130},"Beetle","GR3_Beetle","02"]
[{"$nulls":130},"Beetle","GR3_Beetle","V01"]
[{"$nulls":130},"Beetle","GR3_Beetle","03"]
[{"$nulls":130},"Beetle","GR3_Beetle","04"]
[{"$nulls":130},"Beetle","GR3_Beetle","V02"]
[{"$nulls":130},"Beetle",{"$f":"VLOOKUP(EA392,$EF$7:$EH$72,3,0)","v":"GR3_Beetle"},"V03"]
[{"$nulls":130},"Beetle","GR3_Beetle","V04"]
[{"$nulls":130},"Beetle","GR3_Beetle","05"]
[{"$nulls":130},"Beetle","GR3_Beetle","06"]
[{"$nulls":130},"Beetle","GR3_Beetle","07"]
[{"$nulls":130},"Beetle","GR3_Beetle","08"]
[{"$nulls":130},"Beetle","GR3_Beetle","09"]
[{"$nulls":130},"Beetle","GR3_Beetle","10"]
[{"$nulls":130},"Beetle","GR3_Beetle","V05"]
[{"$nulls":130},"Beetle","GR3_Beetle","V06"]
[{"$nulls":130},"Beetle","GR3_Beetle","V07"]
[{"$nulls":130},"Beetle","GR3_Beetle","V08"]
[{"$nulls":130},"Beetle","GR3_Beetle","V09"]
[{"$nulls":130},"Beetle","GR3_Beetle","V10"]
[{"$nulls":130},"Beetle","GR3_Beetle","V11"]
[{"$nulls":130},"Beetle","GR3_Beetle","V12"]
[{"$nulls":130},"Beetle","GR3_Beetle","11"]
[{"$nulls":130},"Beetle","GR3_Beetle","V13"]
[{"$nulls":130},"Beetle","GR3_Beetle","V14"]
[{"$nulls":130},"Beetle","GR3_Beetle","12"]
[{"$nulls":130},"Beetle","GR3_Beetle","13"]
[{"$nulls":130},"Beetle","GR3_Beetle","14"]
[{"$nulls":130},"Beetle","GR3_Beetle","V15"]
[{"$nulls":130},"Beetle","GR3_Beetle","V16"]
[{"$nulls":130},"Beetle","GR3_Beetle","V17"]
[{"$nulls":130},"Beetle","GR3_Beetle","V18"]
[{"$nulls":130},"Beetle","GR3_Beetle","V19"]
[{"$nulls":130},"Beetle","GR3_Beetle","V20"]
[{"$nulls":130},"Beetle","GR3_Beetle","V21"]
[{"$nulls":130},"Beetle","GR3_Beetle","15"]
[{"$nulls":130},"Beetle","GR3_Beetle","V22"]
[{"$nulls":130},"Beetle","GR3_Beetle","16"]
[{"$nulls":130},"Beetle","GR3_Beetle","V23"]
[{"$nulls":130},"Beetle","GR3_Beetle","V24"]
[{"$nulls":130},"Beetle","GR3_Beetle","V25"]
[{"$nulls":130},"Beetle","GR3_Beetle","V26"]
[{"$nulls":130},"Beetle","GR3_Beetle","V27"]
[{"$nulls":130},"Beetle","GR3_Beetle","17"]
[{"$nulls":130},"Beetle","GR3_Beetle","V28"]
[{"$nulls":130},"Beetle","GR3_Beetle","V29"]
[{"$nulls":130},"Beetle","GR3_Beetle","V30"]
[{"$nulls":130},"Beetle","GR3_Beetle","V31"]
[{"$nulls":130},"Beetle","GR3_Beetle","V32"]
[{"$nulls":130},"Beetle","GR3_Beetle","V33"]
[{"$nulls":130},"Beetle","GR3_Beetle","V34"]
[{"$nulls":130},"Beetle","GR3_Beetle","18"]
[{"$nulls":130},"Beetle","GR3_Beetle","19"]
[{"$nulls":130},"Beetle","GR3_Beetle","V35"]
[{"$nulls":130},"Beetle","GR3_Beetle","V36"]
[{"$nulls":130},"Beetle","GR3_Beetle","V37"]
[{"$nulls":130},"Beetle","GR3_Beetle","V38"]
[{"$nulls":130},"Beetle","GR3_Beetle","V39"]
[{"$nulls":130},"Beetle","GR3_Beetle","V40"]
[{"$nulls":130},"Beetle","GR3_Beetle","V41"]
[{"$nulls":130},"Beetle","GR3_Beetle","V42"]
[{"$nulls":130},"Beetle","GR3_Beetle","V43"]
[{"$nulls":130},"Beetle","GR3_Beetle","V44"]
[{"$nulls":130},"Beetle","GR3_Beetle","V45"]
[{"$nulls":130},"Beetle","GR3_Beetle","V46"]
[{"$nulls":130},"Beetle","GR3_Beetle","V47"]
[{"$nulls":130},"Beetle","GR3_Beetle","V48"]
[{"$nulls":130},"Beetle","GR3_Beetle","V49"]
[{"$nulls":130},"Beetle","GR3_Beetle","V50"]
[{"$nulls":130},"Beetle","GR3_Beetle","V51"]
[{"$nulls":130},"Beetle",{"$f":"VLOOKUP(EA456,$EF$7:$EH$72,3,0)","v":"GR3_Beetle"},"V52"]
[{"$nulls":130},"Beetle","GR3_Beetle","V53"]
[{"$nulls":130},"Beetle","GR3_Beetle","V54"]
[{"$nulls":130},"Beetle","GR3_Beetle","V55"]
[{"$nulls":130},"Beetle","GR3_Beetle","V56"]
[{"$nulls":130},"Mistral","GR3_Mistral"," 01"]
[{"$nulls":130},"Mistral","GR3_Mistral"," V01"]
[{"$nulls":130},"Mistral","GR3_Mistral"," V02"]
[{"$nulls":130},"Mistral","GR3_Mistral"," V03"]
[{"$nulls":130},"Mistral","GR3_Mistral"," V04"]
[{"$nulls":130},"Mistral","GR3_Mistral"," 02"]
[{"$nulls":130},"Mistral","GR3_Mistral"," 03"]
[{"$nulls":130},"Mistral","GR3_Mistral"," 04"]
[{"$nulls":130},"Mistral","GR3_Mistral"," 05"]
[{"$nulls":130},"Phantom","GR3_Phantom"," 01"]
[{"$nulls":130},"Phantom","GR3_Phantom"," V01"]
[{"$nulls":130},"Phantom","GR3_Phantom"," V02"]
[{"$nulls":130},"Phantom","GR3_Phantom"," 02"]
[{"$nulls":130},"Phantom","GR3_Phantom"," V03"]
[{"$nulls":130},"Phantom","GR3_Phantom"," V04"]
[{"$nulls":130},"Phantom","GR3_Phantom"," V05"]
[{"$nulls":130},"Phantom","GR3_Phantom"," 03"]
[{"$nulls":130},"Phantom","GR3_Phantom"," V06"]
[{"$nulls":130},"Phantom","GR3_Phantom"," 04"]
[{"$nulls":130},"Ghost","GR3_Ghost","01"]
[{"$nulls":130},"Ghost","GR3_Ghost","V01"]
[{"$nulls":130},"Ghost","GR3_Ghost","V02"]
[{"$nulls":130},"Ghost","GR3_Ghost","02"]
[{"$nulls":130},"Ghost","GR3_Ghost","V03"]
[{"$nulls":130},"Ghost","GR3_Ghost","V04"]
[{"$nulls":130},"Ghost","GR3_Ghost","V05"]
[{"$nulls":130},"Ghost","GR3_Ghost","V06"]
[{"$nulls":130},"Ghost","GR3_Ghost","V07"]
[{"$nulls":130},"Ghost","GR3_Ghost","03"]
[{"$nulls":130},"Corniche","GR3_Corniche","01"]
[{"$nulls":130},"Corniche","GR3_Corniche","V01"]
[{"$nulls":130},"Corniche","GR3_Corniche","V02"]
[{"$nulls":130},"Corniche","GR3_Corniche","02"]
[{"$nulls":130},"Corniche","GR3_Corniche","V03"]
[{"$nulls":130},"Corniche","GR3_Corniche","V04"]
[{"$nulls":130},"Corniche","GR3_Corniche","V05"]
[{"$nulls":130},"Corniche","GR3_Corniche","V06"]
[{"$nulls":130},"Corniche","GR3_Corniche","03"]
[{"$nulls":130},"Corniche","GR3_Corniche","04"]
[{"$nulls":130},"Leopard","GR4_Leopard"," 01"]
[{"$nulls":130},"Leopard","GR4_Leopard"," 02"]
[{"$nulls":130},"Leopard","GR4_Leopard"," 03"]
[{"$nulls":130},"Leopard","GR4_Leopard"," 04"]
[{"$nulls":130},"Leopard","GR4_Leopard"," V01"]
[{"$nulls":130},"Leopard","GR4_Leopard"," V02"]
[{"$nulls":130},"Leopard","GR4_Leopard"," V03"]
[{"$nulls":130},"Leopard","GR4_Leopard"," 05"]
[{"$nulls":130},"Leopard","GR4_Leopard"," V04"]
[{"$nulls":130},"Leopard","GR4_Leopard"," V05"]
[{"$nulls":130},"Leopard","GR4_Leopard"," V06"]
[{"$nulls":130},"Leopard","GR4_Leopard"," V07"]
[{"$nulls":130},"Leopard","GR4_Leopard"," 06"]
[{"$nulls":130},"Leopard","GR4_Leopard"," 07"]
[{"$nulls":130},"Leopard","GR4_Leopard"," 08"]
[{"$nulls":130},"Leopard","GR4_Leopard"," V08"]
[{"$nulls":130},"Leopard","GR4_Leopard"," V09"]
[{"$nulls":130},"Leopard","GR4_Leopard"," V10"]
[{"$nulls":130},"Leopard","GR4_Leopard"," V11"]
[{"$nulls":130},"Leopard","GR4_Leopard"," V12"]
[{"$nulls":130},"Leopard",{"$f":"VLOOKUP(EA520,$EF$7:$EH$72,3,0)","v":"GR4_Leopard"}," V13"]
[{"$nulls":130},"Leopard","GR4_Leopard"," V14"]
[{"$nulls":130},"Leopard","GR4_Leopard"," V15"]
[{"$nulls":130},"Leopard","GR4_Leopard"," V16"]
[{"$nulls":130},"Leopard","GR4_Leopard"," 09"]
[{"$nulls":130},"Leopard","GR4_Leopard"," V17"]
[{"$nulls":130},"Leopard","GR4_Leopard"," 10"]
[{"$nulls":130},"Leopard","GR4_Leopard"," V18"]
[{"$nulls":130},"Leopard","GR4_Leopard"," 11"]
[{"$nulls":130},"Leopard","GR4_Leopard"," 12"]
[{"$nulls":130},"Leopard","GR4_Leopard"," 13"]
[{"$nulls":130},"Leopard","GR4_Leopard"," V19"]
[{"$nulls":130},"Leopard","GR4_Leopard"," 14"]
[{"$nulls":130},"Leopard","GR4_Leopard"," V20"]
[{"$nulls":130},"Leopard","GR4_Leopard"," V21"]
[{"$nulls":130},"Leopard","GR4_Leopard"," V22"]
[{"$nulls":130},"Leopard","GR4_Leopard"," V23"]
[{"$nulls":130},"Leopard","GR4_Leopard"," V24"]
[{"$nulls":130},"Leopard","GR4_Leopard"," 15"]
[{"$nulls":130},"Leopard","GR4_Leopard"," V25"]
[{"$nulls":130},"Leopard","GR4_Leopard"," 16"]
[{"$nulls":130},"Leopard","GR4_Leopard"," V26"]
[{"$nulls":130},"Leopard","GR4_Leopard"," V27"]
[{"$nulls":130},"Leopard","GR4_Leopard"," V28"]
[{"$nulls":130},"Leopard","GR4_Leopard"," V29"]
[{"$nulls":130},"Monte Carlo","GR3_Monte Carlo"," 01"]
[{"$nulls":130},"Monte Carlo","GR3_Monte Carlo"," 02"]
[{"$nulls":130},"Monte Carlo","GR3_Monte Carlo"," 03"]
[{"$nulls":130},"Monte Carlo","GR3_Monte Carlo"," 04"]
[{"$nulls":130},"Monte Carlo","GR3_Monte Carlo"," 05"]
[{"$nulls":130},"Monte Carlo","GR3_Monte Carlo"," 06"]
[{"$nulls":130},"Monte Carlo","GR3_Monte Carlo"," 07"]
[{"$nulls":130},"Monte Carlo","GR3_Monte Carlo"," V01"]
[{"$nulls":130},"Monte Carlo","GR3_Monte Carlo"," V02"]
[{"$nulls":130},"Monte Carlo","GR3_Monte Carlo"," 08"]
[{"$nulls":130},"Monte Carlo","GR3_Monte Carlo"," 09"]
[{"$nulls":130},"Monte Carlo","GR3_Monte Carlo"," 10"]
[{"$nulls":130},"Monte Carlo","GR3_Monte Carlo"," V03"]
[{"$nulls":130},"Monte Carlo","GR3_Monte Carlo"," V04"]
[{"$nulls":97},"KARNISZ","Tylko_Karnisz",{"$nulls":31},"Monte Carlo","GR3_Monte Carlo"," V05"]
[{"$nulls":130},"Monte Carlo","GR3_Monte Carlo"," V06"]
[{"$nulls":130},"Sebring","GR4_Sebring"," V01"]
[{"$nulls":130},"Sebring","GR4_Sebring"," 01"]
[{"$nulls":130},"Sebring","GR4_Sebring"," 02"]
[{"$nulls":130},"Sebring","GR4_Sebring"," 03"]
[{"$nulls":130},"Sebring","GR4_Sebring"," V02"]
[{"$nulls":130},"Sebring","GR4_Sebring"," 04"]
[{"$nulls":130},"Sebring","GR4_Sebring"," 05"]
[{"$nulls":130},"Sebring","GR4_Sebring"," V03"]
[{"$nulls":130},"Sebring","GR4_Sebring"," 06"]
[{"$nulls":130},"Sebring","GR4_Sebring"," V04"]
[{"$nulls":130},"Sebring","GR4_Sebring"," V05"]
[{"$nulls":130},"Sebring","GR4_Sebring"," V06"]
[{"$nulls":130},"Sebring","GR4_Sebring"," V07"]
[{"$nulls":130},"Sebring","GR4_Sebring"," V08"]
[{"$nulls":130},"Sebring","GR4_Sebring"," 07"]
[{"$nulls":130},"Sebring","GR4_Sebring"," 08"]
[{"$nulls":130},"Sebring","GR4_Sebring"," 09"]
[{"$nulls":130},"DeVille","GR4_DeVille"," V01"]
[{"$nulls":130},"DeVille","GR4_DeVille"," 01"]
[{"$nulls":130},"DeVille","GR4_DeVille"," 02"]
[{"$nulls":130},"DeVille","GR4_DeVille"," V02"]
[{"$nulls":130},"DeVille","GR4_DeVille"," V03"]
[{"$nulls":130},"DeVille","GR4_DeVille"," 03"]
[{"$nulls":130},"DeVille",{"$f":"VLOOKUP(EA584,$EF$7:$EH$72,3,0)","v":"GR4_DeVille"}," V04"]
[{"$nulls":130},"DeVille","GR4_DeVille"," V05"]
[{"$nulls":130},"DeVille","GR4_DeVille"," V06"]
[{"$nulls":130},"DeVille","GR4_DeVille"," V07"]
[{"$nulls":130},"DeVille","GR4_DeVille"," V08"]
[{"$nulls":130},"DeVille","GR4_DeVille"," 04"]
[{"$nulls":130},"DeVille","GR4_DeVille"," 05"]
[{"$nulls":130},"DeVille","GR4_DeVille"," V09"]
[{"$nulls":130},"Wrangler","GR4_Wrangler","V01"]
[{"$nulls":130},"Wrangler","GR4_Wrangler","V02"]
[{"$nulls":130},"Wrangler","GR4_Wrangler","V03"]
[{"$nulls":130},"Wrangler","GR4_Wrangler","V04"]
[{"$nulls":130},"Wrangler","GR4_Wrangler","V05"]
[{"$nulls":130},"Wrangler","GR4_Wrangler","V06"]
[{"$nulls":130},"Wrangler","GR4_Wrangler","V07"]
[{"$nulls":130},"Wrangler","GR4_Wrangler","V08"]
[{"$nulls":130},"Wrangler","GR4_Wrangler","01"]
[{"$nulls":130},"Wrangler","GR4_Wrangler","V09"]
[{"$nulls":130},"Wrangler","GR4_Wrangler","V10"]
[{"$nulls":130},"Wrangler","GR4_Wrangler","V11"]
[{"$nulls":130},"Wrangler","GR4_Wrangler","V12"]
[{"$nulls":130},"Wrangler","GR4_Wrangler","V13"]
[{"$nulls":130},"Wrangler","GR4_Wrangler","V14"]
[{"$nulls":130},"Wrangler","GR4_Wrangler","V15"]
[{"$nulls":130},"Wrangler","GR4_Wrangler","V16"]
[{"$nulls":130},"Wrangler","GR4_Wrangler","V17"]
[{"$nulls":130},"Wrangler","GR4_Wrangler","V18"]
[{"$nulls":130},"Wrangler","GR4_Wrangler","02"]
[{"$nulls":130},"Camaro","GR4_Camaro","01"]
[{"$nulls":130},"Camaro","GR4_Camaro","V01"]
[{"$nulls":130},"Camaro","GR4_Camaro","02"]
[{"$nulls":130},"Camaro","GR4_Camaro","V02"]
[{"$nulls":130},"Camaro","GR4_Camaro","03"]
[{"$nulls":130},"Camaro","GR4_Camaro","V03"]
[{"$nulls":130},"Camaro","GR4_Camaro","04"]
[{"$nulls":130},"Camaro","GR4_Camaro","05"]
[{"$nulls":130},"Camaro","GR4_Camaro","V04"]
[{"$nulls":130},"Camaro","GR4_Camaro","06"]
[{"$nulls":130},"Camaro","GR4_Camaro","07"]
[{"$nulls":130},"Camaro","GR4_Camaro","08"]
[{"$nulls":130},"Camaro","GR4_Camaro","V05"]
[{"$nulls":130},"Camaro","GR4_Camaro","V06"]
[{"$nulls":130},"Camaro","GR4_Camaro","09"]
[{"$nulls":130},"Camaro","GR4_Camaro","V07"]
[{"$nulls":130},"Camaro","GR4_Camaro","10"]
[{"$nulls":130},"Camaro","GR4_Camaro","11"]
[{"$nulls":130},"Camaro","GR4_Camaro","12"]
[{"$nulls":130},"Camaro","GR4_Camaro","V08"]
[{"$nulls":130},"Daytona","GR5_Daytona"," 01"]
[{"$nulls":130},"Daytona","GR5_Daytona"," 02"]
[{"$nulls":130},"Daytona","GR5_Daytona"," 03"]
[{"$nulls":130},"Daytona","GR5_Daytona"," 04"]
[{"$nulls":130},"Daytona","GR5_Daytona"," 05"]
[{"$nulls":130},"Daytona","GR5_Daytona"," 06"]
[{"$nulls":130},"Daytona","GR5_Daytona"," V01"]
[{"$nulls":130},"Daytona","GR5_Daytona"," V02"]
[{"$nulls":130},"Daytona","GR5_Daytona"," V03"]
[{"$nulls":130},"Daytona","GR5_Daytona"," V04"]
[{"$nulls":130},"Daytona","GR5_Daytona"," 07"]
[{"$nulls":130},"Daytona","GR5_Daytona"," 08"]
[{"$nulls":130},"Daytona","GR5_Daytona"," 09"]
[{"$nulls":130},"Daytona","GR5_Daytona"," V05"]
[{"$nulls":130},"Daytona","GR5_Daytona"," V06"]
[{"$nulls":130},"Daytona","GR5_Daytona"," 10"]
[{"$nulls":130},"Daytona",{"$f":"VLOOKUP(EA648,$EF$7:$EH$72,3,0)","v":"GR5_Daytona"}," 11"]
[{"$nulls":130},"Daytona","GR5_Daytona"," V07"]
[{"$nulls":130},"Daytona","GR5_Daytona"," V08"]
[{"$nulls":130},"Daytona","GR5_Daytona"," 12"]
[{"$nulls":130},"Daytona","GR5_Daytona"," V09"]
[{"$nulls":130},"Daytona","GR5_Daytona"," V10"]
[{"$nulls":130},"Daytona","GR5_Daytona"," 13"]
[{"$nulls":130},"Daytona","GR5_Daytona"," 14"]
[{"$nulls":130},"Daytona","GR5_Daytona"," 15"]
[{"$nulls":130},"Daytona","GR5_Daytona"," V11"]
[{"$nulls":130},"Daytona","GR5_Daytona"," 16"]
[{"$nulls":130},"Daytona","GR5_Daytona"," V12"]
[{"$nulls":130},"Daytona","GR5_Daytona"," 17"]
[{"$nulls":130},"Daytona","GR5_Daytona"," V13"]
[{"$nulls":130},"Daytona","GR5_Daytona"," V14"]
[{"$nulls":130},"Daytona","GR5_Daytona"," V15"]
[{"$nulls":130},"Daytona","GR5_Daytona"," V16"]
[{"$nulls":130},"Siber","GR5_Siber","01"]
[{"$nulls":130},"Siber","GR5_Siber","V01"]
[{"$nulls":130},"Siber","GR5_Siber","V02"]
[{"$nulls":130},"Siber","GR5_Siber","V03"]
[{"$nulls":130},"Siber","GR5_Siber","V04"]
[{"$nulls":130},"Siber","GR5_Siber","02"]
[{"$nulls":130},"Siber","GR5_Siber","V05"]
[{"$nulls":130},"Siber","GR5_Siber","03"]
[{"$nulls":130},"Siber","GR5_Siber","04"]
[{"$nulls":130},"Siber","GR5_Siber","V06"]
[{"$nulls":130},"Siber","GR5_Siber","05"]
[{"$nulls":130},"Siber","GR5_Siber","V07"]
[{"$nulls":130},"Siber","GR5_Siber","V08"]
[{"$nulls":130},"Siber","GR5_Siber","06"]
[{"$nulls":130},"Siber","GR5_Siber","07"]
[{"$nulls":130},"Siber","GR5_Siber","08"]
[{"$nulls":130},"Master","GR2_Master"," V01"]
[{"$nulls":130},"Master","GR2_Master"," V02"]
[{"$nulls":130},"Master","GR2_Master"," V03"]
[{"$nulls":130},"Master","GR2_Master"," V04"]
[{"$nulls":130},"Master","GR2_Master"," 01"]
[{"$nulls":130},"Master","GR2_Master"," V05"]
[{"$nulls":130},"Master","GR2_Master"," V06"]
[{"$nulls":130},"Master","GR2_Master"," V07"]
[{"$nulls":130},"Master","GR2_Master"," V08"]
[{"$nulls":130},"Master","GR2_Master"," V09"]
[{"$nulls":130},"Master","GR2_Master"," V10"]
[{"$nulls":130},"Master","GR2_Master"," V11"]
[{"$nulls":130},"Master","GR2_Master","02"]
[{"$nulls":130},"Master","GR2_Master","V12"]
[{"$nulls":130},"Master","GR2_Master","V13"]
[{"$nulls":130},"Master","GR2_Master","V14"]
[{"$nulls":130},"Master","GR2_Master","V15"]
[{"$nulls":130},"Master","GR2_Master","V16"]
[{"$nulls":130},"Master","GR2_Master","V17"]
[{"$nulls":130},"Master","GR2_Master","V18"]
[{"$nulls":130},"Master","GR2_Master","V19"]
[{"$nulls":130},"Master","GR2_Master","V20"]
[{"$nulls":130},"Master","GR2_Master","V21"]
[{"$nulls":130},"Master","GR2_Master","V22"]
[{"$nulls":130},"Master","GR2_Master","V23"]
[{"$nulls":130},"Master","GR2_Master","03"]
[{"$nulls":130},"Royal Monaco","GR3_Royal Monaco","01"]
[{"$nulls":130},"Royal Monaco","GR3_Royal Monaco","02"]
[{"$nulls":130},"Royal Monaco","GR3_Royal Monaco","03"]
[{"$nulls":130},"Lincoln","GR3_Lincoln","01"]
[{"$nulls":130},"Lincoln","GR3_Lincoln","02"]
[{"$nulls":130},"Lincoln",{"$f":"VLOOKUP(EA712,$EF$7:$EH$72,3,0)","v":"GR3_Lincoln"},"03"]
[{"$nulls":130},"Sonett","GR3_Sonett","01"]
[{"$nulls":130},"Sonett","GR3_Sonett","02"]
[{"$nulls":130},"Sonett","GR3_Sonett","03"]
[{"$nulls":130},"Challenger","GR6_Challenger","01"]
[{"$nulls":130},"Challenger","GR6_Challenger","02"]
[{"$nulls":130},"Challenger","GR6_Challenger","03"]
[{"$nulls":130},"Challenger","GR6_Challenger","04"]
[{"$nulls":130},"Challenger","GR6_Challenger","05"]
[{"$nulls":130},"Challenger","GR6_Challenger","06"]
[{"$nulls":130},"Challenger","GR6_Challenger","07"]
[{"$nulls":130},"Challenger","GR6_Challenger","08"]
[{"$nulls":130},"Challenger","GR6_Challenger","09"]
[{"$nulls":130},"Challenger","GR6_Challenger","10"]
[{"$nulls":130},"Challenger","GR6_Challenger","11"]
[{"$nulls":130},"Challenger","GR6_Challenger","12"]
[{"$nulls":130},"Challenger","GR6_Challenger","13"]
[{"$nulls":130},"RB","GR1_RB","01"]
[{"$nulls":130},"RB","GR1_RB","02"]
[{"$nulls":130},"RB","GR1_RB","03"]
[{"$nulls":130},"RB","GR1_RB","04"]
[{"$nulls":130},"RB","GR1_RB","05"]
[{"$nulls":130},"RB","GR1_RB","06"]
[{"$nulls":130},"RB","GR1_RB","07"]
[{"$nulls":130},"RB","GR1_RB","08"]
[{"$nulls":130},"RB","GR1_RB","09"]
[{"$nulls":130},"RB","GR1_RB","10"]
[{"$nulls":130},"RB","GR1_RB","11"]
[{"$nulls":130},"RB","GR1_RB","12"]
[{"$nulls":130},"RB","GR1_RB","13"]
[{"$nulls":130},"RB","GR1_RB","14"]
[{"$nulls":130},"RB","GR1_RB","15"]
[{"$nulls":130},"RB","GR1_RB","16"]
[{"$nulls":130},"Ivy","GR1_Ivy","01"]
[{"$nulls":130},"Ivy","GR1_Ivy","02"]
[{"$nulls":130},"Ivy","GR1_Ivy","03"]
[{"$nulls":130},"Daisy","GR1_Daisy","01"]
[{"$nulls":130},"Daisy","GR1_Daisy","02"]
[{"$nulls":130},"Daisy","GR1_Daisy","03"]
[{"$nulls":130},"Daisy","GR1_Daisy","04"]
[{"$nulls":130},"Daisy","GR1_Daisy","05"]
[{"$nulls":130},"Daisy","GR1_Daisy","06"]
[{"$nulls":130},"Daisy","GR1_Daisy","07"]
[{"$nulls":130},"Daisy","GR1_Daisy","08"]
[{"$nulls":130},"Allysium","GR1_Allysium","01"]
[{"$nulls":130},"Allysium","GR1_Allysium","02"]
[{"$nulls":130},"Allysium","GR1_Allysium","03"]
[{"$nulls":130},"Violet","GR1_Violet","01"]
[{"$nulls":130},"Violet","GR1_Violet","02"]
[{"$nulls":130},"Violet","GR1_Violet","03"]
[{"$nulls":130},"Violet","GR1_Violet","04"]
[{"$nulls":130},"Violet","GR1_Violet","05"]
[{"$nulls":130},"Prado","GR1_Prado",301]
[{"$nulls":130},"Prado","GR1_Prado",302]
[{"$nulls":130},"Prado","GR1_Prado",303]
[{"$nulls":130},"Prado","GR1_Prado",304]
[{"$nulls":130},"Prado","GR1_Prado",305]
[{"$nulls":130},"Prado","GR1_Prado",306]
[{"$nulls":130},"Prado","GR1_Prado",307]
[{"$nulls":130},"Prado","GR1_Prado",308]
[{"$nulls":130},"Prado","GR1_Prado",309]
[{"$nulls":130},"Prado","GR1_Prado",310]
[{"$nulls":130},"Prado","GR1_Prado",311]
[{"$nulls":130},"Prado","GR1_Prado",312]
[{"$nulls":130},"Prado",{"$f":"VLOOKUP(EA776,$EF$7:$EH$72,3,0)","v":"GR1_Prado"},313]
[{"$nulls":130},"Prado","GR1_Prado",314]
[{"$nulls":130},"Prado","GR1_Prado",315]
[{"$nulls":130},"Prado","GR1_Prado",316]
[{"$nulls":130},"Prado","GR1_Prado",317]
[{"$nulls":130},"Prado","GR1_Prado",318]
[{"$nulls":130},"Prado","GR1_Prado",319]
[{"$nulls":130},"Prado","GR1_Prado",320]
[{"$nulls":130},"Prado","GR1_Prado",321]
[{"$nulls":130},"Prado","GR1_Prado",322]
[{"$nulls":130},"Prado","GR1_Prado",323]
[{"$nulls":130},"Prado","GR1_Prado",324]
[{"$nulls":130},"Prado","GR1_Prado",325]
[{"$nulls":130},"Prado","GR1_Prado",326]
[{"$nulls":130},"Prado","GR1_Prado",327]
[{"$nulls":130},"Prado","GR1_Prado",328]
[{"$nulls":130},"Prado","GR1_Prado",329]
[{"$nulls":130},"Prado","GR1_Prado",330]
[{"$nulls":130},"Lacosta","GR1_Lacosta","0100"]
[{"$nulls":130},"Lacosta","GR1_Lacosta","0200"]
[{"$nulls":130},"Lacosta","GR1_Lacosta","0300"]
[{"$nulls":130},"Lacosta","GR1_Lacosta","0400"]
[{"$nulls":130},"Lacosta","GR1_Lacosta","0500"]
[{"$nulls":130},"Lacosta","GR1_Lacosta","0600"]
[{"$nulls":130},"Lacosta","GR1_Lacosta","0700"]
[{"$nulls":130},"Lacosta","GR1_Lacosta","0800"]
[{"$nulls":130},"Lacosta","GR1_Lacosta","0900"]
[{"$nulls":130},"Lacosta","GR1_Lacosta","1000"]
[{"$nulls":130},"Lacosta","GR1_Lacosta","1100"]
[{"$nulls":130},"Lacosta","GR1_Lacosta","1200"]
[{"$nulls":130},"Lacosta","GR1_Lacosta","1300"]
[{"$nulls":130},"Lacosta","GR1_Lacosta","1400"]
[{"$nulls":130},"Lacosta","GR1_Lacosta","1500"]
[{"$nulls":130},"Lacosta","GR1_Lacosta","1600"]
[{"$nulls":130},"Lacosta","GR1_Lacosta","1700"]
[{"$nulls":130},"Lacosta","GR1_Lacosta","1800"]
[{"$nulls":130},"Lacosta","GR1_Lacosta","1900"]
[{"$nulls":130},"Lacosta","GR1_Lacosta","2000"]
[{"$nulls":130},"Lacosta","GR1_Lacosta","2100"]
[{"$nulls":130},"Lacosta","GR1_Lacosta","2200"]
[{"$nulls":130},"Lacosta","GR1_Lacosta","2300"]
[{"$nulls":130},"Lacosta","GR1_Lacosta","2400"]
[{"$nulls":130},"Lacosta","GR1_Lacosta","2500"]
[{"$nulls":130},"Lacosta","GR1_Lacosta","2600"]
[{"$nulls":130},"Calla","GR2_Calla","01"]
[{"$nulls":130},"Calla","GR2_Calla","02"]
[{"$nulls":130},"Calla","GR2_Calla","03"]
[{"$nulls":130},"Calla","GR2_Calla","04"]
[{"$nulls":130},"Calla","GR2_Calla","05"]
[{"$nulls":130},"Calla","GR2_Calla","06"]
[{"$nulls":130},"Rose","GR2_Rose","01"]
[{"$nulls":130},"Rose","GR2_Rose","02"]
[{"$nulls":130},"Lily","GR2_Lily","01"]
[{"$nulls":130},"Lily","GR2_Lily","02"]
[{"$nulls":130},"Iris","GR2_Iris","01"]
[{"$nulls":130},"Iris","GR2_Iris","02"]
[{"$nulls":130},"Iris","GR2_Iris","03"]
[{"$nulls":130},"Peony","GR2_Peony","01"]
[{"$nulls":130},"Peony","GR2_Peony","02"]
[{"$nulls":130},"Peony","GR2_Peony","03"]
[{"$nulls":130},"Peony","GR2_Peony","04"]
[{"$nulls":130},"Peony","GR2_Peony","05"]
[{"$nulls":130},"Peony","GR2_Peony","06"]
[{"$nulls":130},"Peony","GR2_Peony","07"]
[{"$nulls":130},"Peony",{"$f":"VLOOKUP(EA840,$EF$7:$EH$72,3,0)","v":"GR2_Peony"},"08"]
[{"$nulls":130},"Peony","GR2_Peony","09"]
[{"$nulls":130},"Peony","GR2_Peony","10"]
[{"$nulls":130},"Peony","GR2_Peony","11"]
[{"$nulls":130},"Peony","GR2_Peony","12"]
[{"$nulls":130},"Peony","GR2_Peony","13"]
[{"$nulls":130},"Peony","GR2_Peony","14"]
[{"$nulls":130},"Peony","GR2_Peony","15"]
[{"$nulls":130},"Peony","GR2_Peony","16"]
[{"$nulls":130},"Peony","GR2_Peony","17"]
[{"$nulls":130},"Peony","GR2_Peony","18"]
[{"$nulls":130},"Peony","GR2_Peony","19"]
[{"$nulls":130},"Peony","GR2_Peony","20"]
[{"$nulls":130},"Holly","GR2_Holly","01"]
[{"$nulls":130},"Holly","GR2_Holly","02"]
[{"$nulls":130},"Holly","GR2_Holly","03"]
[{"$nulls":130},"Holly","GR2_Holly","04"]
[{"$nulls":130},"Holly","GR2_Holly","05"]
[{"$nulls":130},"Holly","GR2_Holly","06"]
[{"$nulls":130},"Naturaleza","GR2_Naturaleza","01"]
[{"$nulls":130},"Naturaleza","GR2_Naturaleza","02"]
[{"$nulls":130},"Naturaleza","GR2_Naturaleza","03"]
[{"$nulls":130},"Naturaleza","GR2_Naturaleza","04"]
[{"$nulls":130},"Naturaleza","GR2_Naturaleza","05"]
[{"$nulls":130},"Naturaleza","GR2_Naturaleza","06"]
[{"$nulls":130},"Naturaleza","GR2_Naturaleza","07"]
[{"$nulls":130},"Naturaleza","GR2_Naturaleza","08"]
[{"$nulls":130},"Naturaleza","GR2_Naturaleza","09"]
[{"$nulls":130},"Naturaleza","GR2_Naturaleza","10"]
[{"$nulls":130},"Naturaleza","GR2_Naturaleza","11"]
[{"$nulls":130},"Naturaleza","GR2_Naturaleza","12"]
[{"$nulls":130},"Naturaleza","GR2_Naturaleza","13"]
[{"$nulls":130},"Naturaleza","GR2_Naturaleza","14"]
[{"$nulls":130},"Naturaleza","GR2_Naturaleza","15"]
[{"$nulls":130},"Naturaleza","GR2_Naturaleza","16"]
[{"$nulls":130},"Naturaleza","GR2_Naturaleza","17"]
[{"$nulls":130},"Jasmine","GR4_Jasmine","01"]
[{"$nulls":130},"Pansy","GR4_Pansy","01"]
[{"$nulls":130},"Pansy","GR4_Pansy","02"]

{"sheet":"rb01","index":1,"n_rows":13,"n_cols":17,"rows_kept":13,"hidden":true}
["Szer [cm]          Wysokość [cm]",50,60,70,80,90,100,110,120,130,140,150,160,170,180,190,200]
[75,{"$f":"#REF!","v":{"$error":"#REF!"}},{"$f":"#REF!","v":{"$error":"#REF!"}},{"$f":"#REF!","v":{"$error":"#REF!"}},{"$f":"#REF!","v":{"$error":"#REF!"}},{"$f":"#REF!","v":{"$error":"#REF!"}},{"$f":"#REF!","v":{"$error":"#REF!"}},{"$f":"#REF!","v":{"$error":"#REF!"}},{"$f":"#REF!","v":{"$error":"#REF!"}},{"$f":"#REF!","v":{"$error":"#REF!"}},{"$f":"#REF!","v":{"$error":"#REF!"}},{"$f":"#REF!","v":{"$error":"#REF!"}},{"$f":"#REF!","v":{"$error":"#REF!"}},{"$f":"#REF!","v":{"$error":"#REF!"}},{"$f":"#REF!","v":{"$error":"#REF!"}},{"$f":"#REF!","v":{"$error":"#REF!"}},{"$f":"#REF!","v":{"$error":"#REF!"}}]
[100,{"$f":"#REF!","v":{"$error":"#REF!"}},{"$f":"#REF!","v":{"$error":"#REF!"}},{"$f":"#REF!","v":{"$error":"#REF!"}},{"$f":"#REF!","v":{"$error":"#REF!"}},{"$f":"#REF!","v":{"$error":"#REF!"}},{"$f":"#REF!","v":{"$error":"#REF!"}},{"$f":"#REF!","v":{"$error":"#REF!"}},{"$f":"#REF!","v":{"$error":"#REF!"}},{"$f":"#REF!","v":{"$error":"#REF!"}},{"$f":"#REF!","v":{"$error":"#REF!"}},{"$f":"#REF!","v":{"$error":"#REF!"}},{"$f":"#REF!","v":{"$error":"#REF!"}},{"$f":"#REF!","v":{"$error":"#REF!"}},{"$f":"#REF!","v":{"$error":"#REF!"}},{"$f":"#REF!","v":{"$error":"#REF!"}},{"$f":"#REF!","v":{"$error":"#REF!"}}]
[125,{"$f":"#REF!","v":{"$error":"#REF!"}},{"$f":"#REF!","v":{"$error":"#REF!"}},{"$f":"#REF!","v":{"$error":"#REF!"}},{"$f":"#REF!","v":{"$error":"#REF!"}},{"$f":"#REF!","v":{"$error":"#REF!"}},{"$f":"#REF!","v":{"$error":"#REF!"}},{"$f":"#REF!","v":{"$error":"#REF!"}},{"$f":"#REF!","v":{"$error":"#REF!"}},{"$f":"#REF!","v":{"$error":"#REF!"}},{"$f":"#REF!","v":{"$error":"#REF!"}},{"$f":"#REF!","v":{"$error":"#REF!"}},{"$f":"#REF!","v":{"$error":"#REF!"}},{"$f":"#REF!","v":{"$error":"#REF!"}},{"$f":"#REF!","v":{"$error":"#REF!"}},{"$f":"#REF!","v":{"$error":"#REF!"}},{"$f":"#REF!","v":{"$error":"#REF!"}}]
[150,{"$f":"#REF!","v":{"$error":"#REF!"}},{"$f":"#REF!","v":{"$error":"#REF!"}},{"$f":"#REF!","v":{"$error":"#REF!"}},{"$f":"#REF!","v":{"$error":"#REF!"}},{"$f":"#REF!","v":{"$error":"#REF!"}},{"$f":"#REF!","v":{"$error":"#REF!"}},{"$f":"#REF!","v":{"$error":"#REF!"}},{"$f":"#REF!","v":{"$error":"#REF!"}},{"$f":"#REF!","v":{"$error":"#REF!"}},{"$f":"#REF!","v":{"$error":"#REF!"}},{"$f":"#REF!","v":{"$error":"#REF!"}},{"$f":"#REF!","v":{"$error":"#REF!"}},{"$f":"#REF!","v":{"$error":"#REF!"}},{"$f":"#REF!","v":{"$error":"#REF!"}},{"$f":"#REF!","v":{"$error":"#REF!"}},{"$f":"#REF!","v":{"$error":"#REF!"}}]
[175,{"$f":"#REF!","v":{"$error":"#REF!"}},{"$f":"#REF!","v":{"$error":"#REF!"}},{"$f":"#REF!","v":{"$error":"#REF!"}},{"$f":"#REF!","v":{"$error":"#REF!"}},{"$f":"#REF!","v":{"$error":"#REF!"}},{"$f":"#REF!","v":{"$error":"#REF!"}},{"$f":"#REF!","v":{"$error":"#REF!"}},{"$f":"#REF!","v":{"$error":"#REF!"}},{"$f":"#REF!","v":{"$error":"#REF!"}},{"$f":"#REF!","v":{"$error":"#REF!"}},{"$f":"#REF!","v":{"$error":"#REF!"}},{"$f":"#REF!","v":{"$error":"#REF!"}},{"$f":"#REF!","v":{"$error":"#REF!"}},{"$f":"#REF!","v":{"$error":"#REF!"}},{"$f":"#REF!","v":{"$error":"#REF!"}},{"$f":"#REF!","v":{"$error":"#REF!"}}]
[200,{"$f":"#REF!","v":{"$error":"#REF!"}},{"$f":"#REF!","v":{"$error":"#REF!"}},{"$f":"#REF!","v":{"$error":"#REF!"}},{"$f":"#REF!","v":{"$error":"#REF!"}},{"$f":"#REF!","v":{"$error":"#REF!"}},{"$f":"#REF!","v":{"$error":"#REF!"}},{"$f":"#REF!","v":{"$error":"#REF!"}},{"$f":"#REF!","v":{"$error":"#REF!"}},{"$f":"#REF!","v":{"$error":"#REF!"}},{"$f":"#REF!","v":{"$error":"#REF!"}},{"$f":"#REF!","v":{"$error":"#REF!"}},{"$f":"#REF!","v":{"$error":"#REF!"}},{"$f":"#REF!","v":{"$error":"#REF!"}},{"$f":"#REF!","v":{"$error":"#REF!"}},{"$f":"#REF!","v":{"$error":"#REF!"}},{"$f":"#REF!","v":{"$error":"#REF!"}}]
[225,{"$f":"#REF!","v":{"$error":"#REF!"}},{"$f":"#REF!","v":{"$error":"#REF!"}},{"$f":"#REF!","v":{"$error":"#REF!"}},{"$f":"#REF!","v":{"$error":"#REF!"}},{"$f":"#REF!","v":{"$error":"#REF!"}},{"$f":"#REF!","v":{"$error":"#REF!"}},{"$f":"#REF!","v":{"$error":"#REF!"}},{"$f":"#REF!","v":{"$error":"#REF!"}},{"$f":"#REF!","v":{"$error":"#REF!"}},{"$f":"#REF!","v":{"$error":"#REF!"}},{"$f":"#REF!","v":{"$error":"#REF!"}},{"$f":"#REF!","v":{"$error":"#REF!"}},{"$f":"#REF!","v":{"$error":"#REF!"}},{"$f":"#REF!","v":{"$error":"#REF!"}},{"$f":"#REF!","v":{"$error":"#REF!"}},{"$f":"#REF!","v":{"$error":"#REF!"}}]
[250,{"$f":"#REF!","v":{"$error":"#REF!"}},{"$f":"#REF!","v":{"$error":"#REF!"}},{"$f":"#REF!","v":{"$error":"#REF!"}},{"$f":"#REF!","v":{"$error":"#REF!"}},{"$f":"#REF!","v":{"$error":"#REF!"}},{"$f":"#REF!","v":{"$error":"#REF!"}},{"$f":"#REF!","v":{"$error":"#REF!"}},{"$f":"#REF!","v":{"$error":"#REF!"}},{"$f":"#REF!","v":{"$error":"#REF!"}},{"$f":"#REF!","v":{"$error":"#REF!"}},{"$f":"#REF!","v":{"$error":"#REF!"}},{"$f":"#REF!","v":{"$error":"#REF!"}},{"$f":"#REF!","v":{"$error":"#REF!"}},{"$f":"#REF!","v":{"$error":"#REF!"}},{"$f":"#REF!","v":{"$error":"#REF!"}},{"$f":"#REF!","v":{"$error":"#REF!"}}]
[300,{"$f":"#REF!","v":{"$error":"#REF!"}},{"$f":"#REF!","v":{"$error":"#REF!"}},{"$f":"#REF!","v":{"$error":"#REF!"}},{"$f":"#REF!","v":{"$error":"#REF!"}},{"$f":"#REF!","v":{"$error":"#REF!"}},{"$f":"#REF!","v":{"$error":"#REF!"}},{"$f":"#REF!","v":{"$error":"#REF!"}},{"$f":"#REF!","v":{"$error":"#REF!"}},{"$f":"#REF!","v":{"$error":"#REF!"}},{"$f":"#REF!","v":{"$error":"#REF!"}},{"$f":"#REF!","v":{"$error":"#REF!"}},{"$f":"#REF!","v":{"$error":"#REF!"}},{"$f":"#REF!","v":{"$error":"#REF!"}},{"$f":"#REF!","v":{"$error":"#REF!"}},{"$f":"#REF!","v":{"$error":"#REF!"}},{"$f":"#REF!","v":{"$error":"#REF!"}}]
[325,{"$f":"#REF!","v":{"$error":"#REF!"}},{"$f":"#REF!","v":{"$error":"#REF!"}},{"$f":"#REF!","v":{"$error":"#REF!"}},{"$f":"#REF!","v":{"$error":"#REF!"}},{"$f":"#REF!","v":{"$error":"#REF!"}},{"$f":"#REF!","v":{"$error":"#REF!"}},{"$f":"#REF!","v":{"$error":"#REF!"}},{"$f":"#REF!","v":{"$error":"#REF!"}},{"$f":"#REF!","v":{"$error":"#REF!"}},{"$f":"#REF!","v":{"$error":"#REF!"}},{"$f":"#REF!","v":{"$error":"#REF!"}},{"$f":"#REF!","v":{"$error":"#REF!"}},{"$f":"#REF!","v":{"$error":"#REF!"}},{"$f":"#REF!","v":{"$error":"#REF!"}},{"$f":"#REF!","v":{"$error":"#REF!"}},{"$f":"#REF!","v":{"$error":"#REF!"}}]
[350,{"$f":"#REF!","v":{"$error":"#REF!"}},{"$f":"#REF!","v":{"$error":"#REF!"}},{"$f":"#REF!","v":{"$error":"#REF!"}},{"$f":"#REF!","v":{"$error":"#REF!"}},{"$f":"#REF!","v":{"$error":"#REF!"}},{"$f":"#REF!","v":{"$error":"#REF!"}},{"$f":"#REF!","v":{"$error":"#REF!"}},{"$f":"#REF!","v":{"$error":"#REF!"}},{"$f":"#REF!","v":{"$error":"#REF!"}},{"$f":"#REF!","v":{"$error":"#REF!"}},{"$f":"#REF!","v":{"$error":"#REF!"}},{"$f":"#REF!","v":{"$error":"#REF!"}},{"$f":"#REF!","v":{"$error":"#REF!"}},{"$f":"#REF!","v":{"$error":"#REF!"}},{"$f":"#REF!","v":{"$error":"#REF!"}},{"$f":"#REF!","v":{"$error":"#REF!"}}]
["ilość sznurków",2,2,3,3,3,3,3,4,5,5,5,5,5,5,5,5]

{"sheet":"rbk01","index":2,"n_rows":2,"n_cols":28,"rows_kept":2,"hidden":true}
["Szerokoć [cm]",40,50,60,70,80,90,100,110,120,130,140,150,160,170,180,190,200,210,220,230,240,250,260,270,280,290,300]
["Wys.do 350cm",{"$f":"'Cennik SUPER PRICE'!C264","v":57},{"$f":"'Cennik SUPER PRICE'!D264","v":60},{"$f":"'Cennik SUPER PRICE'!E264","v":63},{"$f":"'Cennik SUPER PRICE'!F264","v":78},{"$f":"'Cennik SUPER PRICE'!G264","v":81},{"$f":"'Cennik SUPER PRICE'!H264","v":84},{"$f":"'Cennik SUPER PRICE'!I264","v":88},{"$f":"'Cennik SUPER PRICE'!J264","v":91},{"$f":"'Cennik SUPER PRICE'!K264","v":106},{"$f":"'Cennik SUPER PRICE'!L264","v":109},{"$f":"'Cennik SUPER PRICE'!M264","v":112},{"$f":"'Cennik SUPER PRICE'!N264","v":115},{"$f":"'Cennik SUPER PRICE'!O264","v":119},{"$f":"'Cennik SUPER PRICE'!P264","v":134},{"$f":"'Cennik SUPER PRICE'!Q264","v":137},{"$f":"'Cennik SUPER PRICE'!R264","v":140},{"$f":"'Cennik SUPER PRICE'!S264","v":143},{"$f":"'Cennik SUPER PRICE'!T264","v":146},{"$f":"'Cennik SUPER PRICE'!U264","v":162},{"$f":"'Cennik SUPER PRICE'!V264","v":165},{"$f":"'Cennik SUPER PRICE'!W264","v":168},{"$f":"'Cennik SUPER PRICE'!X264","v":171},{"$f":"'Cennik SUPER PRICE'!Y264","v":196},{"$f":"'Cennik SUPER PRICE'!Z264","v":0},{"$f":"'Cennik SUPER PRICE'!AA264","v":0},{"$f":"'Cennik SUPER PRICE'!AB264","v":0},{"$f":"'Cennik SUPER PRICE'!AC264","v":0}]

{"sheet":"RIBS1","index":3,"n_rows":38,"n_cols":23,"rows_kept":38,"hidden":true}
[null,40,50,60,70,80,90,100,110,120,130,140,150,160,170,180,190,200,210,220,230,240,250]
[40,{"$f":"#REF!","v":{"$error":"#REF!"}},{"$f":"#REF!","v":{"$error":"#REF!"}},{"$f":"#REF!","v":{"$error":"#REF!"}},{"$f":"#REF!","v":{"$error":"#REF!"}},{"$f":"#REF!","v":{"$error":"#REF!"}},{"$f":"#REF!","v":{"$error":"#REF!"}},{"$f":"#REF!","v":{"$error":"#REF!"}},{"$f":"#REF!","v":{"$error":"#REF!"}},{"$f":"#REF!","v":{"$error":"#REF!"}},{"$f":"#REF!","v":{"$error":"#REF!"}},{"$f":"#REF!","v":{"$error":"#REF!"}},{"$f":"#REF!","v":{"$error":"#REF!"}},{"$f":"#REF!","v":{"$error":"#REF!"}},{"$f":"#REF!","v":{"$error":"#REF!"}},{"$f":"#REF!","v":{"$error":"#REF!"}},{"$f":"#REF!","v":{"$error":"#REF!"}},{"$f":"#REF!","v":{"$error":"#REF!"}},{"$f":"#REF!","v":{"$error":"#REF!"}},{"$f":"#REF!","v":{"$error":"#REF!"}},{"$f":"#REF!","v":{"$error":"#REF!"}},{"$f":"#REF!","v":{"$error":"#REF!"}},{"$f":"#REF!","v":{"$error":"#REF!"}}]
[50,{"$f":"#REF!","v":{"$error":"#REF!"}},{"$f":"#REF!","v":{"$error":"#REF!"}},{"$f":"#REF!","v":{"$error":"#REF!"}},{"$f":"#REF!","v":{"$error":"#REF!"}},{"$f":"#REF!","v":{"$error":"#REF!"}},{"$f":"#REF!","v":{"$error":"#REF!"}},{"$f":"#REF!","v":{"$error":"#REF!"}},{"$f":"#REF!","v":{"$error":"#REF!"}},{"$f":"#REF!","v":{"$error":"#REF!"}},{"$f":"#REF!","v":{"$error":"#REF!"}},{"$f":"#REF!","v":{"$error":"#REF!"}},{"$f":"#REF!","v":{"$error":"#REF!"}},{"$f":"#REF!","v":{"$error":"#REF!"}},{"$f":"#REF!","v":{"$error":"#REF!"}},{"$f":"#REF!","v":{"$error":"#REF!"}},{"$f":"#REF!","v":{"$error":"#REF!"}},{"$f":"#REF!","v":{"$error":"#REF!"}},{"$f":"#REF!","v":{"$error":"#REF!"}},{"$f":"#REF!","v":{"$error":"#REF!"}},{"$f":"#REF!","v":{"$error":"#REF!"}},{"$f":"#REF!","v":{"$error":"#REF!"}},{"$f":"#REF!","v":{"$error":"#REF!"}}]
[60,{"$f":"#REF!","v":{"$error":"#REF!"}},{"$f":"#REF!","v":{"$error":"#REF!"}},{"$f":"#REF!","v":{"$error":"#REF!"}},{"$f":"#REF!","v":{"$error":"#REF!"}},{"$f":"#REF!","v":{"$error":"#REF!"}},{"$f":"#REF!","v":{"$error":"#REF!"}},{"$f":"#REF!","v":{"$error":"#REF!"}},{"$f":"#REF!","v":{"$error":"#REF!"}},{"$f":"#REF!","v":{"$error":"#REF!"}},{"$f":"#REF!","v":{"$error":"#REF!"}},{"$f":"#REF!","v":{"$error":"#REF!"}},{"$f":"#REF!","v":{"$error":"#REF!"}},{"$f":"#REF!","v":{"$error":"#REF!"}},{"$f":"#REF!","v":{"$error":"#REF!"}},{"$f":"#REF!","v":{"$error":"#REF!"}},{"$f":"#REF!","v":{"$error":"#REF!"}},{"$f":"#REF!","v":{"$error":"#REF!"}},{"$f":"#REF!","v":{"$error":"#REF!"}},{"$f":"#REF!","v":{"$error":"#REF!"}},{"$f":"#REF!","v":{"$error":"#REF!"}},{"$f":"#REF!","v":{"$error":"#REF!"}},{"$f":"#REF!","v":{"$error":"#REF!"}}]
[70,{"$f":"#REF!","v":{"$error":"#REF!"}},{"$f":"#REF!","v":{"$error":"#REF!"}},{"$f":"#REF!","v":{"$error":"#REF!"}},{"$f":"#REF!","v":{"$error":"#REF!"}},{"$f":"#REF!","v":{"$error":"#REF!"}},{"$f":"#REF!","v":{"$error":"#REF!"}},{"$f":"#REF!","v":{"$error":"#REF!"}},{"$f":"#REF!","v":{"$error":"#REF!"}},{"$f":"#REF!","v":{"$error":"#REF!"}},{"$f":"#REF!","v":{"$error":"#REF!"}},{"$f":"#REF!","v":{"$error":"#REF!"}},{"$f":"#REF!","v":{"$error":"#REF!"}},{"$f":"#REF!","v":{"$error":"#REF!"}},{"$f":"#REF!","v":{"$error":"#REF!"}},{"$f":"#REF!","v":{"$error":"#REF!"}},{"$f":"#REF!","v":{"$error":"#REF!"}},{"$f":"#REF!","v":{"$error":"#REF!"}},{"$f":"#REF!","v":{"$error":"#REF!"}},{"$f":"#REF!","v":{"$error":"#REF!"}},{"$f":"#REF!","v":{"$error":"#REF!"}},{"$f":"#REF!","v":{"$error":"#REF!"}},{"$f":"#REF!","v":{"$error":"#REF!"}}]
[80,{"$f":"#REF!","v":{"$error":"#REF!"}},{"$f":"#REF!","v":{"$error":"#REF!"}},{"$f":"#REF!","v":{"$error":"#REF!"}},{"$f":"#REF!","v":{"$error":"#REF!"}},{"$f":"#REF!","v":{"$error":"#REF!"}},{"$f":"#REF!","v":{"$error":"#REF!"}},{"$f":"#REF!","v":{"$error":"#REF!"}},{"$f":"#REF!","v":{"$error":"#REF!"}},{"$f":"#REF!","v":{"$error":"#REF!"}},{"$f":"#REF!","v":{"$error":"#REF!"}},{"$f":"#REF!","v":{"$error":"#REF!"}},{"$f":"#REF!","v":{"$error":"#REF!"}},{"$f":"#REF!","v":{"$error":"#REF!"}},{"$f":"#REF!","v":{"$error":"#REF!"}},{"$f":"#REF!","v":{"$error":"#REF!"}},{"$f":"#REF!","v":{"$error":"#REF!"}},{"$f":"#REF!","v":{"$error":"#REF!"}},{"$f":"#REF!","v":{"$error":"#REF!"}},{"$f":"#REF!","v":{"$error":"#REF!"}},{"$f":"#REF!","v":{"$error":"#REF!"}},{"$f":"#REF!","v":{"$error":"#REF!"}},{"$f":"#REF!","v":{"$error":"#REF!"}}]
[90,{"$f":"#REF!","v":{"$error":"#REF!"}},{"$f":"#REF!","v":{"$error":"#REF!"}},{"$f":"#REF!","v":{"$error":"#REF!"}},{"$f":"#REF!","v":{"$error":"#REF!"}},{"$f":"#REF!","v":{"$error":"#REF!"}},{"$f":"#REF!","v":{"$error":"#REF!"}},{"$f":"#REF!","v":{"$error":"#REF!"}},{"$f":"#REF!","v":{"$error":"#REF!"}},{"$f":"#REF!","v":{"$error":"#REF!"}},{"$f":"#REF!","v":{"$error":"#REF!"}},{"$f":"#REF!","v":{"$error":"#REF!"}},{"$f":"#REF!","v":{"$error":"#REF!"}},{"$f":"#REF!","v":{"$error":"#REF!"}},{"$f":"#REF!","v":{"$error":"#REF!"}},{"$f":"#REF!","v":{"$error":"#REF!"}},{"$f":"#REF!","v":{"$error":"#REF!"}},{"$f":"#REF!","v":{"$error":"#REF!"}},{"$f":"#REF!","v":{"$error":"#REF!"}},{"$f":"#REF!","v":{"$error":"#REF!"}},{"$f":"#REF!","v":{"$error":"#REF!"}},{"$f":"#REF!","v":{"$error":"#REF!"}},{"$f":"#REF!","v":{"$error":"#REF!"}}]
[100,{"$f":"#REF!","v":{"$error":"#REF!"}},{"$f":"#REF!","v":{"$error":"#REF!"}},{"$f":"#REF!","v":{"$error":"#REF!"}},{"$f":"#REF!","v":{"$error":"#REF!"}},{"$f":"#REF!","v":{"$error":"#REF!"}},{"$f":"#REF!","v":{"$error":"#REF!"}},{"$f":"#REF!","v":{"$error":"#REF!"}},{"$f":"#REF!","v":{"$error":"#REF!"}},{"$f":"#REF!","v":{"$error":"#REF!"}},{"$f":"#REF!","v":{"$error":"#REF!"}},{"$f":"#REF!","v":{"$error":"#REF!"}},{"$f":"#REF!","v":{"$error":"#REF!"}},{"$f":"#REF!","v":{"$error":"#REF!"}},{"$f":"#REF!","v":{"$error":"#REF!"}},{"$f":"#REF!","v":{"$error":"#REF!"}},{"$f":"#REF!","v":{"$error":"#REF!"}},{"$f":"#REF!","v":{"$error":"#REF!"}},{"$f":"#REF!","v":{"$error":"#REF!"}},{"$f":"#REF!","v":{"$error":"#REF!"}},{"$f":"#REF!","v":{"$error":"#REF!"}},{"$f":"#REF!","v":{"$error":"#REF!"}},{"$f":"#REF!","v":{"$error":"#REF!"}}]
[110,{"$f":"#REF!","v":{"$error":"#REF!"}},{"$f":"#REF!","v":{"$error":"#REF!"}},{"$f":"#REF!","v":{"$error":"#REF!"}},{"$f":"#REF!","v":{"$error":"#REF!"}},{"$f":"#REF!","v":{"$error":"#REF!"}},{"$f":"#REF!","v":{"$error":"#REF!"}},{"$f":"#REF!","v":{"$error":"#REF!"}},{"$f":"#REF!","v":{"$error":"#REF!"}},{"$f":"#REF!","v":{"$error":"#REF!"}},{"$f":"#REF!","v":{"$error":"#REF!"}},{"$f":"#REF!","v":{"$error":"#REF!"}},{"$f":"#REF!","v":{"$error":"#REF!"}},{"$f":"#REF!","v":{"$error":"#REF!"}},{"$f":"#REF!","v":{"$error":"#REF!"}},{"$f":"#REF!","v":{"$error":"#REF!"}},{"$f":"#REF!","v":{"$error":"#REF!"}},{"$f":"#REF!","v":{"$error":"#REF!"}},{"$f":"#REF!","v":{"$error":"#REF!"}},{"$f":"#REF!","v":{"$error":"#REF!"}},{"$f":"#REF!","v":{"$error":"#REF!"}},{"$f":"#REF!","v":{"$error":"#REF!"}},{"$f":"#REF!","v":{"$error":"#REF!"}}]
[120,{"$f":"#REF!","v":{"$error":"#REF!"}},{"$f":"#REF!","v":{"$error":"#REF!"}},{"$f":"#REF!","v":{"$error":"#REF!"}},{"$f":"#REF!","v":{"$error":"#REF!"}},{"$f":"#REF!","v":{"$error":"#REF!"}},{"$f":"#REF!","v":{"$error":"#REF!"}},{"$f":"#REF!","v":{"$error":"#REF!"}},{"$f":"#REF!","v":{"$error":"#REF!"}},{"$f":"#REF!","v":{"$error":"#REF!"}},{"$f":"#REF!","v":{"$error":"#REF!"}},{"$f":"#REF!","v":{"$error":"#REF!"}},{"$f":"#REF!","v":{"$error":"#REF!"}},{"$f":"#REF!","v":{"$error":"#REF!"}},{"$f":"#REF!","v":{"$error":"#REF!"}},{"$f":"#REF!","v":{"$error":"#REF!"}},{"$f":"#REF!","v":{"$error":"#REF!"}},{"$f":"#REF!","v":{"$error":"#REF!"}},{"$f":"#REF!","v":{"$error":"#REF!"}},{"$f":"#REF!","v":{"$error":"#REF!"}},{"$f":"#REF!","v":{"$error":"#REF!"}},{"$f":"#REF!","v":{"$error":"#REF!"}},{"$f":"#REF!","v":{"$error":"#REF!"}}]
[130,{"$f":"#REF!","v":{"$error":"#REF!"}},{"$f":"#REF!","v":{"$error":"#REF!"}},{"$f":"#REF!","v":{"$error":"#REF!"}},{"$f":"#REF!","v":{"$error":"#REF!"}},{"$f":"#REF!","v":{"$error":"#REF!"}},{"$f":"#REF!","v":{"$error":"#REF!"}},{"$f":"#REF!","v":{"$error":"#REF!"}},{"$f":"#REF!","v":{"$error":"#REF!"}},{"$f":"#REF!","v":{"$error":"#REF!"}},{"$f":"#REF!","v":{"$error":"#REF!"}},{"$f":"#REF!","v":{"$error":"#REF!"}},{"$f":"#REF!","v":{"$error":"#REF!"}},{"$f":"#REF!","v":{"$error":"#REF!"}},{"$f":"#REF!","v":{"$error":"#REF!"}},{"$f":"#REF!","v":{"$error":"#REF!"}},{"$f":"#REF!","v":{"$error":"#REF!"}},{"$f":"#REF!","v":{"$error":"#REF!"}},{"$f":"#REF!","v":{"$error":"#REF!"}},{"$f":"#REF!","v":{"$error":"#REF!"}},{"$f":"#REF!","v":{"$error":"#REF!"}},{"$f":"#REF!","v":{"$error":"#REF!"}},{"$f":"#REF!","v":{"$error":"#REF!"}}]
[140,{"$f":"#REF!","v":{"$error":"#REF!"}},{"$f":"#REF!","v":{"$error":"#REF!"}},{"$f":"#REF!","v":{"$error":"#REF!"}},{"$f":"#REF!","v":{"$error":"#REF!"}},{"$f":"#REF!","v":{"$error":"#REF!"}},{"$f":"#REF!","v":{"$error":"#REF!"}},{"$f":"#REF!","v":{"$error":"#REF!"}},{"$f":"#REF!","v":{"$error":"#REF!"}},{"$f":"#REF!","v":{"$error":"#REF!"}},{"$f":"#REF!","v":{"$error":"#REF!"}},{"$f":"#REF!","v":{"$error":"#REF!"}},{"$f":"#REF!","v":{"$error":"#REF!"}},{"$f":"#REF!","v":{"$error":"#REF!"}},{"$f":"#REF!","v":{"$error":"#REF!"}},{"$f":"#REF!","v":{"$error":"#REF!"}},{"$f":"#REF!","v":{"$error":"#REF!"}},{"$f":"#REF!","v":{"$error":"#REF!"}},{"$f":"#REF!","v":{"$error":"#REF!"}},{"$f":"#REF!","v":{"$error":"#REF!"}},{"$f":"#REF!","v":{"$error":"#REF!"}},{"$f":"#REF!","v":{"$error":"#REF!"}},{"$f":"#REF!","v":{"$error":"#REF!"}}]
[150,{"$f":"#REF!","v":{"$error":"#REF!"}},{"$f":"#REF!","v":{"$error":"#REF!"}},{"$f":"#REF!","v":{"$error":"#REF!"}},{"$f":"#REF!","v":{"$error":"#REF!"}},{"$f":"#REF!","v":{"$error":"#REF!"}},{"$f":"#REF!","v":{"$error":"#REF!"}},{"$f":"#REF!","v":{"$error":"#REF!"}},{"$f":"#REF!","v":{"$error":"#REF!"}},{"$f":"#REF!","v":{"$error":"#REF!"}},{"$f":"#REF!","v":{"$error":"#REF!"}},{"$f":"#REF!","v":{"$error":"#REF!"}},{"$f":"#REF!","v":{"$error":"#REF!"}},{"$f":"#REF!","v":{"$error":"#REF!"}},{"$f":"#REF!","v":{"$error":"#REF!"}},{"$f":"#REF!","v":{"$error":"#REF!"}},{"$f":"#REF!","v":{"$error":"#REF!"}},{"$f":"#REF!","v":{"$error":"#REF!"}},{"$f":"#REF!","v":{"$error":"#REF!"}},{"$f":"#REF!","v":{"$error":"#REF!"}},{"$f":"#REF!","v":{"$error":"#REF!"}},{"$f":"#REF!","v":{"$error":"#REF!"}},{"$f":"#REF!","v":{"$error":"#REF!"}}]
[160,{"$f":"#REF!","v":{"$error":"#REF!"}},{"$f":"#REF!","v":{"$error":"#REF!"}},{"$f":"#REF!","v":{"$error":"#REF!"}},{"$f":"#REF!","v":{"$error":"#REF!"}},{"$f":"#REF!","v":{"$error":"#REF!"}},{"$f":"#REF!","v":{"$error":"#REF!"}},{"$f":"#REF!","v":{"$error":"#REF!"}},{"$f":"#REF!","v":{"$error":"#REF!"}},{"$f":"#REF!","v":{"$error":"#REF!"}},{"$f":"#REF!","v":{"$error":"#REF!"}},{"$f":"#REF!","v":{"$error":"#REF!"}},{"$f":"#REF!","v":{"$error":"#REF!"}},{"$f":"#REF!","v":{"$error":"#REF!"}},{"$f":"#REF!","v":{"$error":"#REF!"}},{"$f":"#REF!","v":{"$error":"#REF!"}},{"$f":"#REF!","v":{"$error":"#REF!"}},{"$f":"#REF!","v":{"$error":"#REF!"}},{"$f":"#REF!","v":{"$error":"#REF!"}},{"$f":"#REF!","v":{"$error":"#REF!"}},{"$f":"#REF!","v":{"$error":"#REF!"}},{"$f":"#REF!","v":{"$error":"#REF!"}},{"$f":"#REF!","v":{"$error":"#REF!"}}]
[170,{"$f":"#REF!","v":{"$error":"#REF!"}},{"$f":"#REF!","v":{"$error":"#REF!"}},{"$f":"#REF!","v":{"$error":"#REF!"}},{"$f":"#REF!","v":{"$error":"#REF!"}},{"$f":"#REF!","v":{"$error":"#REF!"}},{"$f":"#REF!","v":{"$error":"#REF!"}},{"$f":"#REF!","v":{"$error":"#REF!"}},{"$f":"#REF!","v":{"$error":"#REF!"}},{"$f":"#REF!","v":{"$error":"#REF!"}},{"$f":"#REF!","v":{"$error":"#REF!"}},{"$f":"#REF!","v":{"$error":"#REF!"}},{"$f":"#REF!","v":{"$error":"#REF!"}},{"$f":"#REF!","v":{"$error":"#REF!"}},{"$f":"#REF!","v":{"$error":"#REF!"}},{"$f":"#REF!","v":{"$error":"#REF!"}},{"$f":"#REF!","v":{"$error":"#REF!"}},{"$f":"#REF!","v":{"$error":"#REF!"}},{"$f":"#REF!","v":{"$error":"#REF!"}},{"$f":"#REF!","v":{"$error":"#REF!"}},{"$f":"#REF!","v":{"$error":"#REF!"}},{"$f":"#REF!","v":{"$error":"#REF!"}},{"$f":"#REF!","v":{"$error":"#REF!"}}]
[180,{"$f":"#REF!","v":{"$error":"#REF!"}},{"$f":"#REF!","v":{"$error":"#REF!"}},{"$f":"#REF!","v":{"$error":"#REF!"}},{"$f":"#REF!","v":{"$error":"#REF!"}},{"$f":"#REF!","v":{"$error":"#REF!"}},{"$f":"#REF!","v":{"$error":"#REF!"}},{"$f":"#REF!","v":{"$error":"#REF!"}},{"$f":"#REF!","v":{"$error":"#REF!"}},{"$f":"#REF!","v":{"$error":"#REF!"}},{"$f":"#REF!","v":{"$error":"#REF!"}},{"$f":"#REF!","v":{"$error":"#REF!"}},{"$f":"#REF!","v":{"$error":"#REF!"}},{"$f":"#REF!","v":{"$error":"#REF!"}},{"$f":"#REF!","v":{"$error":"#REF!"}},{"$f":"#REF!","v":{"$error":"#REF!"}},{"$f":"#REF!","v":{"$error":"#REF!"}},{"$f":"#REF!","v":{"$error":"#REF!"}},{"$f":"#REF!","v":{"$error":"#REF!"}},{"$f":"#REF!","v":{"$error":"#REF!"}},{"$f":"#REF!","v":{"$error":"#REF!"}},{"$f":"#REF!","v":{"$error":"#REF!"}},{"$f":"#REF!","v":{"$error":"#REF!"}}]
[190,{"$f":"#REF!","v":{"$error":"#REF!"}},{"$f":"#REF!","v":{"$error":"#REF!"}},{"$f":"#REF!","v":{"$error":"#REF!"}},{"$f":"#REF!","v":{"$error":"#REF!"}},{"$f":"#REF!","v":{"$error":"#REF!"}},{"$f":"#REF!","v":{"$error":"#REF!"}},{"$f":"#REF!","v":{"$error":"#REF!"}},{"$f":"#REF!","v":{"$error":"#REF!"}},{"$f":"#REF!","v":{"$error":"#REF!"}},{"$f":"#REF!","v":{"$error":"#REF!"}},{"$f":"#REF!","v":{"$error":"#REF!"}},{"$f":"#REF!","v":{"$error":"#REF!"}},{"$f":"#REF!","v":{"$error":"#REF!"}},{"$f":"#REF!","v":{"$error":"#REF!"}},{"$f":"#REF!","v":{"$error":"#REF!"}},{"$f":"#REF!","v":{"$error":"#REF!"}},{"$f":"#REF!","v":{"$error":"#REF!"}},{"$f":"#REF!","v":{"$error":"#REF!"}},{"$f":"#REF!","v":{"$error":"#REF!"}},{"$f":"#REF!","v":{"$error":"#REF!"}},{"$f":"#REF!","v":{"$error":"#REF!"}},{"$f":"#REF!","v":{"$error":"#REF!"}}]
[200,{"$f":"#REF!","v":{"$error":"#REF!"}},{"$f":"#REF!","v":{"$error":"#REF!"}},{"$f":"#REF!","v":{"$error":"#REF!"}},{"$f":"#REF!","v":{"$error":"#REF!"}},{"$f":"#REF!","v":{"$error":"#REF!"}},{"$f":"#REF!","v":{"$error":"#REF!"}},{"$f":"#REF!","v":{"$error":"#REF!"}},{"$f":"#REF!","v":{"$error":"#REF!"}},{"$f":"#REF!","v":{"$error":"#REF!"}},{"$f":"#REF!","v":{"$error":"#REF!"}},{"$f":"#REF!","v":{"$error":"#REF!"}},{"$f":"#REF!","v":{"$error":"#REF!"}},{"$f":"#REF!","v":{"$error":"#REF!"}},{"$f":"#REF!","v":{"$error":"#REF!"}},{"$f":"#REF!","v":{"$error":"#REF!"}},{"$f":"#REF!","v":{"$error":"#REF!"}},{"$f":"#REF!","v":{"$error":"#REF!"}},{"$f":"#REF!","v":{"$error":"#REF!"}},{"$f":"#REF!","v":{"$error":"#REF!"}},{"$f":"#REF!","v":{"$error":"#REF!"}},{"$f":"#REF!","v":{"$error":"#REF!"}},{"$f":"#REF!","v":{"$error":"#REF!"}}]
[210,{"$f":"#REF!","v":{"$error":"#REF!"}},{"$f":"#REF!","v":{"$error":"#REF!"}},{"$f":"#REF!","v":{"$error":"#REF!"}},{"$f":"#REF!","v":{"$error":"#REF!"}},{"$f":"#REF!","v":{"$error":"#REF!"}},{"$f":"#REF!","v":{"$error":"#REF!"}},{"$f":"#REF!","v":{"$error":"#REF!"}},{"$f":"#REF!","v":{"$error":"#REF!"}},{"$f":"#REF!","v":{"$error":"#REF!"}},{"$f":"#REF!","v":{"$error":"#REF!"}},{"$f":"#REF!","v":{"$error":"#REF!"}},{"$f":"#REF!","v":{"$error":"#REF!"}},{"$f":"#REF!","v":{"$error":"#REF!"}},{"$f":"#REF!","v":{"$error":"#REF!"}},{"$f":"#REF!","v":{"$error":"#REF!"}},{"$f":"#REF!","v":{"$error":"#REF!"}},{"$f":"#REF!","v":{"$error":"#REF!"}},{"$f":"#REF!","v":{"$error":"#REF!"}},{"$f":"#REF!","v":{"$error":"#REF!"}},{"$f":"#REF!","v":{"$error":"#REF!"}},{"$f":"#REF!","v":{"$error":"#REF!"}},{"$f":"#REF!","v":{"$error":"#REF!"}}]
[220,{"$f":"#REF!","v":{"$error":"#REF!"}},{"$f":"#REF!","v":{"$error":"#REF!"}},{"$f":"#REF!","v":{"$error":"#REF!"}},{"$f":"#REF!","v":{"$error":"#REF!"}},{"$f":"#REF!","v":{"$error":"#REF!"}},{"$f":"#REF!","v":{"$error":"#REF!"}},{"$f":"#REF!","v":{"$error":"#REF!"}},{"$f":"#REF!","v":{"$error":"#REF!"}},{"$f":"#REF!","v":{"$error":"#REF!"}},{"$f":"#REF!","v":{"$error":"#REF!"}},{"$f":"#REF!","v":{"$error":"#REF!"}},{"$f":"#REF!","v":{"$error":"#REF!"}},{"$f":"#REF!","v":{"$error":"#REF!"}},{"$f":"#REF!","v":{"$error":"#REF!"}},{"$f":"#REF!","v":{"$error":"#REF!"}},{"$f":"#REF!","v":{"$error":"#REF!"}},{"$f":"#REF!","v":{"$error":"#REF!"}},{"$f":"#REF!","v":{"$error":"#REF!"}},{"$f":"#REF!","v":{"$error":"#REF!"}},{"$f":"#REF!","v":{"$error":"#REF!"}},{"$f":"#REF!","v":{"$error":"#REF!"}},{"$f":"#REF!","v":{"$error":"#REF!"}}]
[230,{"$f":"#REF!","v":{"$error":"#REF!"}},{"$f":"#REF!","v":{"$error":"#REF!"}},{"$f":"#REF!","v":{"$error":"#REF!"}},{"$f":"#REF!","v":{"$error":"#REF!"}},{"$f":"#REF!","v":{"$error":"#REF!"}},{"$f":"#REF!","v":{"$error":"#REF!"}},{"$f":"#REF!","v":{"$error":"#REF!"}},{"$f":"#REF!","v":{"$error":"#REF!"}},{"$f":"#REF!","v":{"$error":"#REF!"}},{"$f":"#REF!","v":{"$error":"#REF!"}},{"$f":"#REF!","v":{"$error":"#REF!"}},{"$f":"#REF!","v":{"$error":"#REF!"}},{"$f":"#REF!","v":{"$error":"#REF!"}},{"$f":"#REF!","v":{"$error":"#REF!"}},{"$f":"#REF!","v":{"$error":"#REF!"}},{"$f":"#REF!","v":{"$error":"#REF!"}},{"$f":"#REF!","v":{"$error":"#REF!"}},{"$f":"#REF!","v":{"$error":"#REF!"}},{"$f":"#REF!","v":{"$error":"#REF!"}},{"$f":"#REF!","v":{"$error":"#REF!"}},{"$f":"#REF!","v":{"$error":"#REF!"}},{"$f":"#REF!","v":{"$error":"#REF!"}}]
[240,{"$f":"#REF!","v":{"$error":"#REF!"}},{"$f":"#REF!","v":{"$error":"#REF!"}},{"$f":"#REF!","v":{"$error":"#REF!"}},{"$f":"#REF!","v":{"$error":"#REF!"}},{"$f":"#REF!","v":{"$error":"#REF!"}},{"$f":"#REF!","v":{"$error":"#REF!"}},{"$f":"#REF!","v":{"$error":"#REF!"}},{"$f":"#REF!","v":{"$error":"#REF!"}},{"$f":"#REF!","v":{"$error":"#REF!"}},{"$f":"#REF!","v":{"$error":"#REF!"}},{"$f":"#REF!","v":{"$error":"#REF!"}},{"$f":"#REF!","v":{"$error":"#REF!"}},{"$f":"#REF!","v":{"$error":"#REF!"}},{"$f":"#REF!","v":{"$error":"#REF!"}},{"$f":"#REF!","v":{"$error":"#REF!"}},{"$f":"#REF!","v":{"$error":"#REF!"}},{"$f":"#REF!","v":{"$error":"#REF!"}},{"$f":"#REF!","v":{"$error":"#REF!"}},{"$f":"#REF!","v":{"$error":"#REF!"}},{"$f":"#REF!","v":{"$error":"#REF!"}},{"$f":"#REF!","v":{"$error":"#REF!"}},{"$f":"#REF!","v":{"$error":"#REF!"}}]
[250,{"$f":"#REF!","v":{"$error":"#REF!"}},{"$f":"#REF!","v":{"$error":"#REF!"}},{"$f":"#REF!","v":{"$error":"#REF!"}},{"$f":"#REF!","v":{"$error":"#REF!"}},{"$f":"#REF!","v":{"$error":"#REF!"}},{"$f":"#REF!","v":{"$error":"#REF!"}},{"$f":"#REF!","v":{"$error":"#REF!"}},{"$f":"#REF!","v":{"$error":"#REF!"}},{"$f":"#REF!","v":{"$error":"#REF!"}},{"$f":"#REF!","v":{"$error":"#REF!"}},{"$f":"#REF!","v":{"$error":"#REF!"}},{"$f":"#REF!","v":{"$error":"#REF!"}},{"$f":"#REF!","v":{"$error":"#REF!"}},{"$f":"#REF!","v":{"$error":"#REF!"}},{"$f":"#REF!","v":{"$error":"#REF!"}},{"$f":"#REF!","v":{"$error":"#REF!"}},{"$f":"#REF!","v":{"$error":"#REF!"}},{"$f":"#REF!","v":{"$error":"#REF!"}},{"$f":"#REF!","v":{"$error":"#REF!"}},{"$f":"#REF!","v":{"$error":"#REF!"}},{"$f":"#REF!","v":{"$error":"#REF!"}},{"$f":"#REF!","v":{"$error":"#REF!"}}]
[260,{"$f":"#REF!","v":{"$error":"#REF!"}},{"$f":"#REF!","v":{"$error":"#REF!"}},{"$f":"#REF!","v":{"$error":"#REF!"}},{"$f":"#REF!","v":{"$error":"#REF!"}},{"$f":"#REF!","v":{"$error":"#REF!"}},{"$f":"#REF!","v":{"$error":"#REF!"}},{"$f":"#REF!","v":{"$error":"#REF!"}},{"$f":"#REF!","v":{"$error":"#REF!"}},{"$f":"#REF!","v":{"$error":"#REF!"}},{"$f":"#REF!","v":{"$error":"#REF!"}},{"$f":"#REF!","v":{"$error":"#REF!"}},{"$f":"#REF!","v":{"$error":"#REF!"}},{"$f":"#REF!","v":{"$error":"#REF!"}},{"$f":"#REF!","v":{"$error":"#REF!"}},{"$f":"#REF!","v":{"$error":"#REF!"}},{"$f":"#REF!","v":{"$error":"#REF!"}},{"$f":"#REF!","v":{"$error":"#REF!"}},{"$f":"#REF!","v":{"$error":"#REF!"}},{"$f":"#REF!","v":{"$error":"#REF!"}},{"$f":"#REF!","v":{"$error":"#REF!"}},{"$f":"#REF!","v":{"$error":"#REF!"}},{"$f":"#REF!","v":{"$error":"#REF!"}}]
[270,{"$f":"#REF!","v":{"$error":"#REF!"}},{"$f":"#REF!","v":{"$error":"#REF!"}},{"$f":"#REF!","v":{"$error":"#REF!"}},{"$f":"#REF!","v":{"$error":"#REF!"}},{"$f":"#REF!","v":{"$error":"#REF!"}},{"$f":"#REF!","v":{"$error":"#REF!"}},{"$f":"#REF!","v":{"$error":"#REF!"}},{"$f":"#REF!","v":{"$error":"#REF!"}},{"$f":"#REF!","v":{"$error":"#REF!"}},{"$f":"#REF!","v":{"$error":"#REF!"}},{"$f":"#REF!","v":{"$error":"#REF!"}},{"$f":"#REF!","v":{"$error":"#REF!"}},{"$f":"#REF!","v":{"$error":"#REF!"}},{"$f":"#REF!","v":{"$error":"#REF!"}},{"$f":"#REF!","v":{"$error":"#REF!"}},{"$f":"#REF!","v":{"$error":"#REF!"}},{"$f":"#REF!","v":{"$error":"#REF!"}},{"$f":"#REF!","v":{"$error":"#REF!"}},{"$f":"#REF!","v":{"$error":"#REF!"}},{"$f":"#REF!","v":{"$error":"#REF!"}},{"$f":"#REF!","v":{"$error":"#REF!"}},{"$f":"#REF!","v":{"$error":"#REF!"}}]
[280,{"$f":"#REF!","v":{"$error":"#REF!"}},{"$f":"#REF!","v":{"$error":"#REF!"}},{"$f":"#REF!","v":{"$error":"#REF!"}},{"$f":"#REF!","v":{"$error":"#REF!"}},{"$f":"#REF!","v":{"$error":"#REF!"}},{"$f":"#REF!","v":{"$error":"#REF!"}},{"$f":"#REF!","v":{"$error":"#REF!"}},{"$f":"#REF!","v":{"$error":"#REF!"}},{"$f":"#REF!","v":{"$error":"#REF!"}},{"$f":"#REF!","v":{"$error":"#REF!"}},{"$f":"#REF!","v":{"$error":"#REF!"}},{"$f":"#REF!","v":{"$error":"#REF!"}},{"$f":"#REF!","v":{"$error":"#REF!"}},{"$f":"#REF!","v":{"$error":"#REF!"}},{"$f":"#REF!","v":{"$error":"#REF!"}},{"$f":"#REF!","v":{"$error":"#REF!"}},{"$f":"#REF!","v":{"$error":"#REF!"}},{"$f":"#REF!","v":{"$error":"#REF!"}},{"$f":"#REF!","v":{"$error":"#REF!"}},{"$f":"#REF!","v":{"$error":"#REF!"}},{"$f":"#REF!","v":{"$error":"#REF!"}},{"$f":"#REF!","v":{"$error":"#REF!"}}]
[290,{"$f":"#REF!","v":{"$error":"#REF!"}},{"$f":"#REF!","v":{"$error":"#REF!"}},{"$f":"#REF!","v":{"$error":"#REF!"}},{"$f":"#REF!","v":{"$error":"#REF!"}},{"$f":"#REF!","v":{"$error":"#REF!"}},{"$f":"#REF!","v":{"$error":"#REF!"}},{"$f":"#REF!","v":{"$error":"#REF!"}},{"$f":"#REF!","v":{"$error":"#REF!"}},{"$f":"#REF!","v":{"$error":"#REF!"}},{"$f":"#REF!","v":{"$error":"#REF!"}},{"$f":"#REF!","v":{"$error":"#REF!"}},{"$f":"#REF!","v":{"$error":"#REF!"}},{"$f":"#REF!","v":{"$error":"#REF!"}},{"$f":"#REF!","v":{"$error":"#REF!"}},{"$f":"#REF!","v":{"$error":"#REF!"}},{"$f":"#REF!","v":{"$error":"#REF!"}},{"$f":"#REF!","v":{"$error":"#REF!"}},{"$f":"#REF!","v":{"$error":"#REF!"}},{"$f":"#REF!","v":{"$error":"#REF!"}},{"$f":"#REF!","v":{"$error":"#REF!"}},{"$f":"#REF!","v":{"$error":"#REF!"}},{"$f":"#REF!","v":{"$error":"#REF!"}}]
[300,{"$f":"#REF!","v":{"$error":"#REF!"}},{"$f":"#REF!","v":{"$error":"#REF!"}},{"$f":"#REF!","v":{"$error":"#REF!"}},{"$f":"#REF!","v":{"$error":"#REF!"}},{"$f":"#REF!","v":{"$error":"#REF!"}},{"$f":"#REF!","v":{"$error":"#REF!"}},{"$f":"#REF!","v":{"$error":"#REF!"}},{"$f":"#REF!","v":{"$error":"#REF!"}},{"$f":"#REF!","v":{"$error":"#REF!"}},{"$f":"#REF!","v":{"$error":"#REF!"}},{"$f":"#REF!","v":{"$error":"#REF!"}},{"$f":"#REF!","v":{"$error":"#REF!"}},{"$f":"#REF!","v":{"$error":"#REF!"}},{"$f":"#REF!","v":{"$error":"#REF!"}},{"$f":"#REF!","v":{"$error":"#REF!"}},{"$f":"#REF!","v":{"$error":"#REF!"}},{"$f":"#REF!","v":{"$error":"#REF!"}},{"$f":"#REF!","v":{"$error":"#REF!"}},{"$f":"#REF!","v":{"$error":"#REF!"}},{"$f":"#REF!","v":{"$error":"#REF!"}},{"$f":"#REF!","v":{"$error":"#REF!"}},{"$f":"#REF!","v":{"$error":"#REF!"}}]
[310,{"$f":"#REF!","v":{"$error":"#REF!"}},{"$f":"#REF!","v":{"$error":"#REF!"}},{"$f":"#REF!","v":{"$error":"#REF!"}},{"$f":"#REF!","v":{"$error":"#REF!"}},{"$f":"#REF!","v":{"$error":"#REF!"}},{"$f":"#REF!","v":{"$error":"#REF!"}},{"$f":"#REF!","v":{"$error":"#REF!"}},{"$f":"#REF!","v":{"$error":"#REF!"}},{"$f":"#REF!","v":{"$error":"#REF!"}},{"$f":"#REF!","v":{"$error":"#REF!"}},{"$f":"#REF!","v":{"$error":"#REF!"}},{"$f":"#REF!","v":{"$error":"#REF!"}},{"$f":"#REF!","v":{"$error":"#REF!"}},{"$f":"#REF!","v":{"$error":"#REF!"}},{"$f":"#REF!","v":{"$error":"#REF!"}},{"$f":"#REF!","v":{"$error":"#REF!"}},{"$f":"#REF!","v":{"$error":"#REF!"}},{"$f":"#REF!","v":{"$error":"#REF!"}},{"$f":"#REF!","v":{"$error":"#REF!"}},{"$f":"#REF!","v":{"$error":"#REF!"}},{"$f":"#REF!","v":{"$error":"#REF!"}},{"$f":"#REF!","v":{"$error":"#REF!"}}]
[320,{"$f":"#REF!","v":{"$error":"#REF!"}},{"$f":"#REF!","v":{"$error":"#REF!"}},{"$f":"#REF!","v":{"$error":"#REF!"}},{"$f":"#REF!","v":{"$error":"#REF!"}},{"$f":"#REF!","v":{"$error":"#REF!"}},{"$f":"#REF!","v":{"$error":"#REF!"}},{"$f":"#REF!","v":{"$error":"#REF!"}},{"$f":"#REF!","v":{"$error":"#REF!"}},{"$f":"#REF!","v":{"$error":"#REF!"}},{"$f":"#REF!","v":{"$error":"#REF!"}},{"$f":"#REF!","v":{"$error":"#REF!"}},{"$f":"#REF!","v":{"$error":"#REF!"}},{"$f":"#REF!","v":{"$error":"#REF!"}},{"$f":"#REF!","v":{"$error":"#REF!"}},{"$f":"#REF!","v":{"$error":"#REF!"}},{"$f":"#REF!","v":{"$error":"#REF!"}},{"$f":"#REF!","v":{"$error":"#REF!"}},{"$f":"#REF!","v":{"$error":"#REF!"}},{"$f":"#REF!","v":{"$error":"#REF!"}},{"$f":"#REF!","v":{"$error":"#REF!"}},{"$f":"#REF!","v":{"$error":"#REF!"}},{"$f":"#REF!","v":{"$error":"#REF!"}}]
[330,{"$f":"#REF!","v":{"$error":"#REF!"}},{"$f":"#REF!","v":{"$error":"#REF!"}},{"$f":"#REF!","v":{"$error":"#REF!"}},{"$f":"#REF!","v":{"$error":"#REF!"}},{"$f":"#REF!","v":{"$error":"#REF!"}},{"$f":"#REF!","v":{"$error":"#REF!"}},{"$f":"#REF!","v":{"$error":"#REF!"}},{"$f":"#REF!","v":{"$error":"#REF!"}},{"$f":"#REF!","v":{"$error":"#REF!"}},{"$f":"#REF!","v":{"$error":"#REF!"}},{"$f":"#REF!","v":{"$error":"#REF!"}},{"$f":"#REF!","v":{"$error":"#REF!"}},{"$f":"#REF!","v":{"$error":"#REF!"}},{"$f":"#REF!","v":{"$error":"#REF!"}},{"$f":"#REF!","v":{"$error":"#REF!"}},{"$f":"#REF!","v":{"$error":"#REF!"}},{"$f":"#REF!","v":{"$error":"#REF!"}},{"$f":"#REF!","v":{"$error":"#REF!"}},{"$f":"#REF!","v":{"$error":"#REF!"}},{"$f":"#REF!","v":{"$error":"#REF!"}},{"$f":"#REF!","v":{"$error":"#REF!"}},{"$f":"#REF!","v":{"$error":"#REF!"}}]
[340,{"$f":"#REF!","v":{"$error":"#REF!"}},{"$f":"#REF!","v":{"$error":"#REF!"}},{"$f":"#REF!","v":{"$error":"#REF!"}},{"$f":"#REF!","v":{"$error":"#REF!"}},{"$f":"#REF!","v":{"$error":"#REF!"}},{"$f":"#REF!","v":{"$error":"#REF!"}},{"$f":"#REF!","v":{"$error":"#REF!"}},{"$f":"#REF!","v":{"$error":"#REF!"}},{"$f":"#REF!","v":{"$error":"#REF!"}},{"$f":"#REF!","v":{"$error":"#REF!"}},{"$f":"#REF!","v":{"$error":"#REF!"}},{"$f":"#REF!","v":{"$error":"#REF!"}},{"$f":"#REF!","v":{"$error":"#REF!"}},{"$f":"#REF!","v":{"$error":"#REF!"}},{"$f":"#REF!","v":{"$error":"#REF!"}},{"$f":"#REF!","v":{"$error":"#REF!"}},{"$f":"#REF!","v":{"$error":"#REF!"}},{"$f":"#REF!","v":{"$error":"#REF!"}},{"$f":"#REF!","v":{"$error":"#REF!"}},{"$f":"#REF!","v":{"$error":"#REF!"}},{"$f":"#REF!","v":{"$error":"#REF!"}},{"$f":"#REF!","v":{"$error":"#REF!"}}]
[350,{"$f":"#REF!","v":{"$error":"#REF!"}},{"$f":"#REF!","v":{"$error":"#REF!"}},{"$f":"#REF!","v":{"$error":"#REF!"}},{"$f":"#REF!","v":{"$error":"#REF!"}},{"$f":"#REF!","v":{"$error":"#REF!"}},{"$f":"#REF!","v":{"$error":"#REF!"}},{"$f":"#REF!","v":{"$error":"#REF!"}},{"$f":"#REF!","v":{"$error":"#REF!"}},{"$f":"#REF!","v":{"$error":"#REF!"}},{"$f":"#REF!","v":{"$error":"#REF!"}},{"$f":"#REF!","v":{"$error":"#REF!"}},{"$f":"#REF!","v":{"$error":"#REF!"}},{"$f":"#REF!","v":{"$error":"#REF!"}},{"$f":"#REF!","v":{"$error":"#REF!"}},{"$f":"#REF!","v":{"$error":"#REF!"}},{"$f":"#REF!","v":{"$error":"#REF!"}},{"$f":"#REF!","v":{"$error":"#REF!"}},{"$f":"#REF!","v":{"$error":"#REF!"}},{"$f":"#REF!","v":{"$error":"#REF!"}},{"$f":"#REF!","v":{"$error":"#REF!"}},{"$f":"#REF!","v":{"$error":"#REF!"}},{"$f":"#REF!","v":{"$error":"#REF!"}}]
[360,{"$f":"#REF!","v":{"$error":"#REF!"}},{"$f":"#REF!","v":{"$error":"#REF!"}},{"$f":"#REF!","v":{"$error":"#REF!"}},{"$f":"#REF!","v":{"$error":"#REF!"}},{"$f":"#REF!","v":{"$error":"#REF!"}},{"$f":"#REF!","v":{"$error":"#REF!"}},{"$f":"#REF!","v":{"$error":"#REF!"}},{"$f":"#REF!","v":{"$error":"#REF!"}},{"$f":"#REF!","v":{"$error":"#REF!"}},{"$f":"#REF!","v":{"$error":"#REF!"}},{"$f":"#REF!","v":{"$error":"#REF!"}},{"$f":"#REF!","v":{"$error":"#REF!"}},{"$f":"#REF!","v":{"$error":"#REF!"}},{"$f":"#REF!","v":{"$error":"#REF!"}},{"$f":"#REF!","v":{"$error":"#REF!"}},{"$f":"#REF!","v":{"$error":"#REF!"}},{"$f":"#REF!","v":{"$error":"#REF!"}},{"$f":"#REF!","v":{"$error":"#REF!"}},{"$f":"#REF!","v":{"$error":"#REF!"}},{"$f":"#REF!","v":{"$error":"#REF!"}},{"$f":"#REF!","v":{"$error":"#REF!"}},{"$f":"#REF!","v":{"$error":"#REF!"}}]
[370,{"$f":"#REF!","v":{"$error":"#REF!"}},{"$f":"#REF!","v":{"$error":"#REF!"}},{"$f":"#REF!","v":{"$error":"#REF!"}},{"$f":"#REF!","v":{"$error":"#REF!"}},{"$f":"#REF!","v":{"$error":"#REF!"}},{"$f":"#REF!","v":{"$error":"#REF!"}},{"$f":"#REF!","v":{"$error":"#REF!"}},{"$f":"#REF!","v":{"$error":"#REF!"}},{"$f":"#REF!","v":{"$error":"#REF!"}},{"$f":"#REF!","v":{"$error":"#REF!"}},{"$f":"#REF!","v":{"$error":"#REF!"}},{"$f":"#REF!","v":{"$error":"#REF!"}},{"$f":"#REF!","v":{"$error":"#REF!"}},{"$f":"#REF!","v":{"$error":"#REF!"}},{"$f":"#REF!","v":{"$error":"#REF!"}},{"$f":"#REF!","v":{"$error":"#REF!"}},{"$f":"#REF!","v":{"$error":"#REF!"}},{"$f":"#REF!","v":{"$error":"#REF!"}},{"$f":"#REF!","v":{"$error":"#REF!"}},{"$f":"#REF!","v":{"$error":"#REF!"}},{"$f":"#REF!","v":{"$error":"#REF!"}},{"$f":"#REF!","v":{"$error":"#REF!"}}]
[380,{"$f":"#REF!","v":{"$error":"#REF!"}},{"$f":"#REF!","v":{"$error":"#REF!"}},{"$f":"#REF!","v":{"$error":"#REF!"}},{"$f":"#REF!","v":{"$error":"#REF!"}},{"$f":"#REF!","v":{"$error":"#REF!"}},{"$f":"#REF!","v":{"$error":"#REF!"}},{"$f":"#REF!","v":{"$error":"#REF!"}},{"$f":"#REF!","v":{"$error":"#REF!"}},{"$f":"#REF!","v":{"$error":"#REF!"}},{"$f":"#REF!","v":{"$error":"#REF!"}},{"$f":"#REF!","v":{"$error":"#REF!"}},{"$f":"#REF!","v":{"$error":"#REF!"}},{"$f":"#REF!","v":{"$error":"#REF!"}},{"$f":"#REF!","v":{"$error":"#REF!"}},{"$f":"#REF!","v":{"$error":"#REF!"}},{"$f":"#REF!","v":{"$error":"#REF!"}},{"$f":"#REF!","v":{"$error":"#REF!"}},{"$f":"#REF!","v":{"$error":"#REF!"}},{"$f":"#REF!","v":{"$error":"#REF!"}},{"$f":"#REF!","v":{"$error":"#REF!"}},{"$f":"#REF!","v":{"$error":"#REF!"}},{"$f":"#REF!","v":{"$error":"#REF!"}}]
[390,{"$f":"#REF!","v":{"$error":"#REF!"}},{"$f":"#REF!","v":{"$error":"#REF!"}},{"$f":"#REF!","v":{"$error":"#REF!"}},{"$f":"#REF!","v":{"$error":"#REF!"}},{"$f":"#REF!","v":{"$error":"#REF!"}},{"$f":"#REF!","v":{"$error":"#REF!"}},{"$f":"#REF!","v":{"$error":"#REF!"}},{"$f":"#REF!","v":{"$error":"#REF!"}},{"$f":"#REF!","v":{"$error":"#REF!"}},{"$f":"#REF!","v":{"$error":"#REF!"}},{"$f":"#REF!","v":{"$error":"#REF!"}},{"$f":"#REF!","v":{"$error":"#REF!"}},{"$f":"#REF!","v":{"$error":"#REF!"}},{"$f":"#REF!","v":{"$error":"#REF!"}},{"$f":"#REF!","v":{"$error":"#REF!"}},{"$f":"#REF!","v":{"$error":"#REF!"}},{"$f":"#REF!","v":{"$error":"#REF!"}},{"$f":"#REF!","v":{"$error":"#REF!"}},{"$f":"#REF!","v":{"$error":"#REF!"}},{"$f":"#REF!","v":{"$error":"#REF!"}},{"$f":"#REF!","v":{"$error":"#REF!"}},{"$f":"#REF!","v":{"$error":"#REF!"}}]
[400,{"$f":"#REF!","v":{"$error":"#REF!"}},{"$f":"#REF!","v":{"$error":"#REF!"}},{"$f":"#REF!","v":{"$error":"#REF!"}},{"$f":"#REF!","v":{"$error":"#REF!"}},{"$f":"#REF!","v":{"$error":"#REF!"}},{"$f":"#REF!","v":{"$error":"#REF!"}},{"$f":"#REF!","v":{"$error":"#REF!"}},{"$f":"#REF!","v":{"$error":"#REF!"}},{"$f":"#REF!","v":{"$error":"#REF!"}},{"$f":"#REF!","v":{"$error":"#REF!"}},{"$f":"#REF!","v":{"$error":"#REF!"}},{"$f":"#REF!","v":{"$error":"#REF!"}},{"$f":"#REF!","v":{"$error":"#REF!"}},{"$f":"#REF!","v":{"$error":"#REF!"}},{"$f":"#REF!","v":{"$error":"#REF!"}},{"$f":"#REF!","v":{"$error":"#REF!"}},{"$f":"#REF!","v":{"$error":"#REF!"}},{"$f":"#REF!","v":{"$error":"#REF!"}},{"$f":"#REF!","v":{"$error":"#REF!"}},{"$f":"#REF!","v":{"$error":"#REF!"}},{"$f":"#REF!","v":{"$error":"#REF!"}},{"$f":"#REF!","v":{"$error":"#REF!"}}]

{"sheet":"RIBS2","index":4,"n_rows":38,"n_cols":23,"rows_kept":38,"hidden":true}
[null,40,50,60,70,80,90,100,110,120,130,140,150,160,170,180,190,200,210,220,230,240,250]
[40,{"$f":"#REF!","v":{"$error":"#REF!"}},{"$f":"#REF!","v":{"$error":"#REF!"}},{"$f":"#REF!","v":{"$error":"#REF!"}},{"$f":"#REF!","v":{"$error":"#REF!"}},{"$f":"#REF!","v":{"$error":"#REF!"}},{"$f":"#REF!","v":{"$error":"#REF!"}},{"$f":"#REF!","v":{"$error":"#REF!"}},{"$f":"#REF!","v":{"$error":"#REF!"}},{"$f":"#REF!","v":{"$error":"#REF!"}},{"$f":"#REF!","v":{"$error":"#REF!"}},{"$f":"#REF!","v":{"$error":"#REF!"}},{"$f":"#REF!","v":{"$error":"#REF!"}},{"$f":"#REF!","v":{"$error":"#REF!"}},{"$f":"#REF!","v":{"$error":"#REF!"}},{"$f":"#REF!","v":{"$error":"#REF!"}},{"$f":"#REF!","v":{"$error":"#REF!"}},{"$f":"#REF!","v":{"$error":"#REF!"}},{"$f":"#REF!","v":{"$error":"#REF!"}},{"$f":"#REF!","v":{"$error":"#REF!"}},{"$f":"#REF!","v":{"$error":"#REF!"}},{"$f":"#REF!","v":{"$error":"#REF!"}},{"$f":"#REF!","v":{"$error":"#REF!"}}]
[50,{"$f":"#REF!","v":{"$error":"#REF!"}},{"$f":"#REF!","v":{"$error":"#REF!"}},{"$f":"#REF!","v":{"$error":"#REF!"}},{"$f":"#REF!","v":{"$error":"#REF!"}},{"$f":"#REF!","v":{"$error":"#REF!"}},{"$f":"#REF!","v":{"$error":"#REF!"}},{"$f":"#REF!","v":{"$error":"#REF!"}},{"$f":"#REF!","v":{"$error":"#REF!"}},{"$f":"#REF!","v":{"$error":"#REF!"}},{"$f":"#REF!","v":{"$error":"#REF!"}},{"$f":"#REF!","v":{"$error":"#REF!"}},{"$f":"#REF!","v":{"$error":"#REF!"}},{"$f":"#REF!","v":{"$error":"#REF!"}},{"$f":"#REF!","v":{"$error":"#REF!"}},{"$f":"#REF!","v":{"$error":"#REF!"}},{"$f":"#REF!","v":{"$error":"#REF!"}},{"$f":"#REF!","v":{"$error":"#REF!"}},{"$f":"#REF!","v":{"$error":"#REF!"}},{"$f":"#REF!","v":{"$error":"#REF!"}},{"$f":"#REF!","v":{"$error":"#REF!"}},{"$f":"#REF!","v":{"$error":"#REF!"}},{"$f":"#REF!","v":{"$error":"#REF!"}}]
[60,{"$f":"#REF!","v":{"$error":"#REF!"}},{"$f":"#REF!","v":{"$error":"#REF!"}},{"$f":"#REF!","v":{"$error":"#REF!"}},{"$f":"#REF!","v":{"$error":"#REF!"}},{"$f":"#REF!","v":{"$error":"#REF!"}},{"$f":"#REF!","v":{"$error":"#REF!"}},{"$f":"#REF!","v":{"$error":"#REF!"}},{"$f":"#REF!","v":{"$error":"#REF!"}},{"$f":"#REF!","v":{"$error":"#REF!"}},{"$f":"#REF!","v":{"$error":"#REF!"}},{"$f":"#REF!","v":{"$error":"#REF!"}},{"$f":"#REF!","v":{"$error":"#REF!"}},{"$f":"#REF!","v":{"$error":"#REF!"}},{"$f":"#REF!","v":{"$error":"#REF!"}},{"$f":"#REF!","v":{"$error":"#REF!"}},{"$f":"#REF!","v":{"$error":"#REF!"}},{"$f":"#REF!","v":{"$error":"#REF!"}},{"$f":"#REF!","v":{"$error":"#REF!"}},{"$f":"#REF!","v":{"$error":"#REF!"}},{"$f":"#REF!","v":{"$error":"#REF!"}},{"$f":"#REF!","v":{"$error":"#REF!"}},{"$f":"#REF!","v":{"$error":"#REF!"}}]
[70,{"$f":"#REF!","v":{"$error":"#REF!"}},{"$f":"#REF!","v":{"$error":"#REF!"}},{"$f":"#REF!","v":{"$error":"#REF!"}},{"$f":"#REF!","v":{"$error":"#REF!"}},{"$f":"#REF!","v":{"$error":"#REF!"}},{"$f":"#REF!","v":{"$error":"#REF!"}},{"$f":"#REF!","v":{"$error":"#REF!"}},{"$f":"#REF!","v":{"$error":"#REF!"}},{"$f":"#REF!","v":{"$error":"#REF!"}},{"$f":"#REF!","v":{"$error":"#REF!"}},{"$f":"#REF!","v":{"$error":"#REF!"}},{"$f":"#REF!","v":{"$error":"#REF!"}},{"$f":"#REF!","v":{"$error":"#REF!"}},{"$f":"#REF!","v":{"$error":"#REF!"}},{"$f":"#REF!","v":{"$error":"#REF!"}},{"$f":"#REF!","v":{"$error":"#REF!"}},{"$f":"#REF!","v":{"$error":"#REF!"}},{"$f":"#REF!","v":{"$error":"#REF!"}},{"$f":"#REF!","v":{"$error":"#REF!"}},{"$f":"#REF!","v":{"$error":"#REF!"}},{"$f":"#REF!","v":{"$error":"#REF!"}},{"$f":"#REF!","v":{"$error":"#REF!"}}]
[80,{"$f":"#REF!","v":{"$error":"#REF!"}},{"$f":"#REF!","v":{"$error":"#REF!"}},{"$f":"#REF!","v":{"$error":"#REF!"}},{"$f":"#REF!","v":{"$error":"#REF!"}},{"$f":"#REF!","v":{"$error":"#REF!"}},{"$f":"#REF!","v":{"$error":"#REF!"}},{"$f":"#REF!","v":{"$error":"#REF!"}},{"$f":"#REF!","v":{"$error":"#REF!"}},{"$f":"#REF!","v":{"$error":"#REF!"}},{"$f":"#REF!","v":{"$error":"#REF!"}},{"$f":"#REF!","v":{"$error":"#REF!"}},{"$f":"#REF!","v":{"$error":"#REF!"}},{"$f":"#REF!","v":{"$error":"#REF!"}},{"$f":"#REF!","v":{"$error":"#REF!"}},{"$f":"#REF!","v":{"$error":"#REF!"}},{"$f":"#REF!","v":{"$error":"#REF!"}},{"$f":"#REF!","v":{"$error":"#REF!"}},{"$f":"#REF!","v":{"$error":"#REF!"}},{"$f":"#REF!","v":{"$error":"#REF!"}},{"$f":"#REF!","v":{"$error":"#REF!"}},{"$f":"#REF!","v":{"$error":"#REF!"}},{"$f":"#REF!","v":{"$error":"#REF!"}}]
[90,{"$f":"#REF!","v":{"$error":"#REF!"}},{"$f":"#REF!","v":{"$error":"#REF!"}},{"$f":"#REF!","v":{"$error":"#REF!"}},{"$f":"#REF!","v":{"$error":"#REF!"}},{"$f":"#REF!","v":{"$error":"#REF!"}},{"$f":"#REF!","v":{"$error":"#REF!"}},{"$f":"#REF!","v":{"$error":"#REF!"}},{"$f":"#REF!","v":{"$error":"#REF!"}},{"$f":"#REF!","v":{"$error":"#REF!"}},{"$f":"#REF!","v":{"$error":"#REF!"}},{"$f":"#REF!","v":{"$error":"#REF!"}},{"$f":"#REF!","v":{"$error":"#REF!"}},{"$f":"#REF!","v":{"$error":"#REF!"}},{"$f":"#REF!","v":{"$error":"#REF!"}},{"$f":"#REF!","v":{"$error":"#REF!"}},{"$f":"#REF!","v":{"$error":"#REF!"}},{"$f":"#REF!","v":{"$error":"#REF!"}},{"$f":"#REF!","v":{"$error":"#REF!"}},{"$f":"#REF!","v":{"$error":"#REF!"}},{"$f":"#REF!","v":{"$error":"#REF!"}},{"$f":"#REF!","v":{"$error":"#REF!"}},{"$f":"#REF!","v":{"$error":"#REF!"}}]
[100,{"$f":"#REF!","v":{"$error":"#REF!"}},{"$f":"#REF!","v":{"$error":"#REF!"}},{"$f":"#REF!","v":{"$error":"#REF!"}},{"$f":"#REF!","v":{"$error":"#REF!"}},{"$f":"#REF!","v":{"$error":"#REF!"}},{"$f":"#REF!","v":{"$error":"#REF!"}},{"$f":"#REF!","v":{"$error":"#REF!"}},{"$f":"#REF!","v":{"$error":"#REF!"}},{"$f":"#REF!","v":{"$error":"#REF!"}},{"$f":"#REF!","v":{"$error":"#REF!"}},{"$f":"#REF!","v":{"$error":"#REF!"}},{"$f":"#REF!","v":{"$error":"#REF!"}},{"$f":"#REF!","v":{"$error":"#REF!"}},{"$f":"#REF!","v":{"$error":"#REF!"}},{"$f":"#REF!","v":{"$error":"#REF!"}},{"$f":"#REF!","v":{"$error":"#REF!"}},{"$f":"#REF!","v":{"$error":"#REF!"}},{"$f":"#REF!","v":{"$error":"#REF!"}},{"$f":"#REF!","v":{"$error":"#REF!"}},{"$f":"#REF!","v":{"$error":"#REF!"}},{"$f":"#REF!","v":{"$error":"#REF!"}},{"$f":"#REF!","v":{"$error":"#REF!"}}]
[110,{"$f":"#REF!","v":{"$error":"#REF!"}},{"$f":"#REF!","v":{"$error":"#REF!"}},{"$f":"#REF!","v":{"$error":"#REF!"}},{"$f":"#REF!","v":{"$error":"#REF!"}},{"$f":"#REF!","v":{"$error":"#REF!"}},{"$f":"#REF!","v":{"$error":"#REF!"}},{"$f":"#REF!","v":{"$error":"#REF!"}},{"$f":"#REF!","v":{"$error":"#REF!"}},{"$f":"#REF!","v":{"$error":"#REF!"}},{"$f":"#REF!","v":{"$error":"#REF!"}},{"$f":"#REF!","v":{"$error":"#REF!"}},{"$f":"#REF!","v":{"$error":"#REF!"}},{"$f":"#REF!","v":{"$error":"#REF!"}},{"$f":"#REF!","v":{"$error":"#REF!"}},{"$f":"#REF!","v":{"$error":"#REF!"}},{"$f":"#REF!","v":{"$error":"#REF!"}},{"$f":"#REF!","v":{"$error":"#REF!"}},{"$f":"#REF!","v":{"$error":"#REF!"}},{"$f":"#REF!","v":{"$error":"#REF!"}},{"$f":"#REF!","v":{"$error":"#REF!"}},{"$f":"#REF!","v":{"$error":"#REF!"}},{"$f":"#REF!","v":{"$error":"#REF!"}}]
[120,{"$f":"#REF!","v":{"$error":"#REF!"}},{"$f":"#REF!","v":{"$error":"#REF!"}},{"$f":"#REF!","v":{"$error":"#REF!"}},{"$f":"#REF!","v":{"$error":"#REF!"}},{"$f":"#REF!","v":{"$error":"#REF!"}},{"$f":"#REF!","v":{"$error":"#REF!"}},{"$f":"#REF!","v":{"$error":"#REF!"}},{"$f":"#REF!","v":{"$error":"#REF!"}},{"$f":"#REF!","v":{"$error":"#REF!"}},{"$f":"#REF!","v":{"$error":"#REF!"}},{"$f":"#REF!","v":{"$error":"#REF!"}},{"$f":"#REF!","v":{"$error":"#REF!"}},{"$f":"#REF!","v":{"$error":"#REF!"}},{"$f":"#REF!","v":{"$error":"#REF!"}},{"$f":"#REF!","v":{"$error":"#REF!"}},{"$f":"#REF!","v":{"$error":"#REF!"}},{"$f":"#REF!","v":{"$error":"#REF!"}},{"$f":"#REF!","v":{"$error":"#REF!"}},{"$f":"#REF!","v":{"$error":"#REF!"}},{"$f":"#REF!","v":{"$error":"#REF!"}},{"$f":"#REF!","v":{"$error":"#REF!"}},{"$f":"#REF!","v":{"$error":"#REF!"}}]
[130,{"$f":"#REF!","v":{"$error":"#REF!"}},{"$f":"#REF!","v":{"$error":"#REF!"}},{"$f":"#REF!","v":{"$error":"#REF!"}},{"$f":"#REF!","v":{"$error":"#REF!"}},{"$f":"#REF!","v":{"$error":"#REF!"}},{"$f":"#REF!","v":{"$error":"#REF!"}},{"$f":"#REF!","v":{"$error":"#REF!"}},{"$f":"#REF!","v":{"$error":"#REF!"}},{"$f":"#REF!","v":{"$error":"#REF!"}},{"$f":"#REF!","v":{"$error":"#REF!"}},{"$f":"#REF!","v":{"$error":"#REF!"}},{"$f":"#REF!","v":{"$error":"#REF!"}},{"$f":"#REF!","v":{"$error":"#REF!"}},{"$f":"#REF!","v":{"$error":"#REF!"}},{"$f":"#REF!","v":{"$error":"#REF!"}},{"$f":"#REF!","v":{"$error":"#REF!"}},{"$f":"#REF!","v":{"$error":"#REF!"}},{"$f":"#REF!","v":{"$error":"#REF!"}},{"$f":"#REF!","v":{"$error":"#REF!"}},{"$f":"#REF!","v":{"$error":"#REF!"}},{"$f":"#REF!","v":{"$error":"#REF!"}},{"$f":"#REF!","v":{"$error":"#REF!"}}]
[140,{"$f":"#REF!","v":{"$error":"#REF!"}},{"$f":"#REF!","v":{"$error":"#REF!"}},{"$f":"#REF!","v":{"$error":"#REF!"}},{"$f":"#REF!","v":{"$error":"#REF!"}},{"$f":"#REF!","v":{"$error":"#REF!"}},{"$f":"#REF!","v":{"$error":"#REF!"}},{"$f":"#REF!","v":{"$error":"#REF!"}},{"$f":"#REF!","v":{"$error":"#REF!"}},{"$f":"#REF!","v":{"$error":"#REF!"}},{"$f":"#REF!","v":{"$error":"#REF!"}},{"$f":"#REF!","v":{"$error":"#REF!"}},{"$f":"#REF!","v":{"$error":"#REF!"}},{"$f":"#REF!","v":{"$error":"#REF!"}},{"$f":"#REF!","v":{"$error":"#REF!"}},{"$f":"#REF!","v":{"$error":"#REF!"}},{"$f":"#REF!","v":{"$error":"#REF!"}},{"$f":"#REF!","v":{"$error":"#REF!"}},{"$f":"#REF!","v":{"$error":"#REF!"}},{"$f":"#REF!","v":{"$error":"#REF!"}},{"$f":"#REF!","v":{"$error":"#REF!"}},{"$f":"#REF!","v":{"$error":"#REF!"}},{"$f":"#REF!","v":{"$error":"#REF!"}}]
[150,{"$f":"#REF!","v":{"$error":"#REF!"}},{"$f":"#REF!","v":{"$error":"#REF!"}},{"$f":"#REF!","v":{"$error":"#REF!"}},{"$f":"#REF!","v":{"$error":"#REF!"}},{"$f":"#REF!","v":{"$error":"#REF!"}},{"$f":"#REF!","v":{"$error":"#REF!"}},{"$f":"#REF!","v":{"$error":"#REF!"}},{"$f":"#REF!","v":{"$error":"#REF!"}},{"$f":"#REF!","v":{"$error":"#REF!"}},{"$f":"#REF!","v":{"$error":"#REF!"}},{"$f":"#REF!","v":{"$error":"#REF!"}},{"$f":"#REF!","v":{"$error":"#REF!"}},{"$f":"#REF!","v":{"$error":"#REF!"}},{"$f":"#REF!","v":{"$error":"#REF!"}},{"$f":"#REF!","v":{"$error":"#REF!"}},{"$f":"#REF!","v":{"$error":"#REF!"}},{"$f":"#REF!","v":{"$error":"#REF!"}},{"$f":"#REF!","v":{"$error":"#REF!"}},{"$f":"#REF!","v":{"$error":"#REF!"}},{"$f":"#REF!","v":{"$error":"#REF!"}},{"$f":"#REF!","v":{"$error":"#REF!"}},{"$f":"#REF!","v":{"$error":"#REF!"}}]
[160,{"$f":"#REF!","v":{"$error":"#REF!"}},{"$f":"#REF!","v":{"$error":"#REF!"}},{"$f":"#REF!","v":{"$error":"#REF!"}},{"$f":"#REF!","v":{"$error":"#REF!"}},{"$f":"#REF!","v":{"$error":"#REF!"}},{"$f":"#REF!","v":{"$error":"#REF!"}},{"$f":"#REF!","v":{"$error":"#REF!"}},{"$f":"#REF!","v":{"$error":"#REF!"}},{"$f":"#REF!","v":{"$error":"#REF!"}},{"$f":"#REF!","v":{"$error":"#REF!"}},{"$f":"#REF!","v":{"$error":"#REF!"}},{"$f":"#REF!","v":{"$error":"#REF!"}},{"$f":"#REF!","v":{"$error":"#REF!"}},{"$f":"#REF!","v":{"$error":"#REF!"}},{"$f":"#REF!","v":{"$error":"#REF!"}},{"$f":"#REF!","v":{"$error":"#REF!"}},{"$f":"#REF!","v":{"$error":"#REF!"}},{"$f":"#REF!","v":{"$error":"#REF!"}},{"$f":"#REF!","v":{"$error":"#REF!"}},{"$f":"#REF!","v":{"$error":"#REF!"}},{"$f":"#REF!","v":{"$error":"#REF!"}},{"$f":"#REF!","v":{"$error":"#REF!"}}]
[170,{"$f":"#REF!","v":{"$error":"#REF!"}},{"$f":"#REF!","v":{"$error":"#REF!"}},{"$f":"#REF!","v":{"$error":"#REF!"}},{"$f":"#REF!","v":{"$error":"#REF!"}},{"$f":"#REF!","v":{"$error":"#REF!"}},{"$f":"#REF!","v":{"$error":"#REF!"}},{"$f":"#REF!","v":{"$error":"#REF!"}},{"$f":"#REF!","v":{"$error":"#REF!"}},{"$f":"#REF!","v":{"$error":"#REF!"}},{"$f":"#REF!","v":{"$error":"#REF!"}},{"$f":"#REF!","v":{"$error":"#REF!"}},{"$f":"#REF!","v":{"$error":"#REF!"}},{"$f":"#REF!","v":{"$error":"#REF!"}},{"$f":"#REF!","v":{"$error":"#REF!"}},{"$f":"#REF!","v":{"$error":"#REF!"}},{"$f":"#REF!","v":{"$error":"#REF!"}},{"$f":"#REF!","v":{"$error":"#REF!"}},{"$f":"#REF!","v":{"$error":"#REF!"}},{"$f":"#REF!","v":{"$error":"#REF!"}},{"$f":"#REF!","v":{"$error":"#REF!"}},{"$f":"#REF!","v":{"$error":"#REF!"}},{"$f":"#REF!","v":{"$error":"#REF!"}}]
[180,{"$f":"#REF!","v":{"$error":"#REF!"}},{"$f":"#REF!","v":{"$error":"#REF!"}},{"$f":"#REF!","v":{"$error":"#REF!"}},{"$f":"#REF!","v":{"$error":"#REF!"}},{"$f":"#REF!","v":{"$error":"#REF!"}},{"$f":"#REF!","v":{"$error":"#REF!"}},{"$f":"#REF!","v":{"$error":"#REF!"}},{"$f":"#REF!","v":{"$error":"#REF!"}},{"$f":"#REF!","v":{"$error":"#REF!"}},{"$f":"#REF!","v":{"$error":"#REF!"}},{"$f":"#REF!","v":{"$error":"#REF!"}},{"$f":"#REF!","v":{"$error":"#REF!"}},{"$f":"#REF!","v":{"$error":"#REF!"}},{"$f":"#REF!","v":{"$error":"#REF!"}},{"$f":"#REF!","v":{"$error":"#REF!"}},{"$f":"#REF!","v":{"$error":"#REF!"}},{"$f":"#REF!","v":{"$error":"#REF!"}},{"$f":"#REF!","v":{"$error":"#REF!"}},{"$f":"#REF!","v":{"$error":"#REF!"}},{"$f":"#REF!","v":{"$error":"#REF!"}},{"$f":"#REF!","v":{"$error":"#REF!"}},{"$f":"#REF!","v":{"$error":"#REF!"}}]
[190,{"$f":"#REF!","v":{"$error":"#REF!"}},{"$f":"#REF!","v":{"$error":"#REF!"}},{"$f":"#REF!","v":{"$error":"#REF!"}},{"$f":"#REF!","v":{"$error":"#REF!"}},{"$f":"#REF!","v":{"$error":"#REF!"}},{"$f":"#REF!","v":{"$error":"#REF!"}},{"$f":"#REF!","v":{"$error":"#REF!"}},{"$f":"#REF!","v":{"$error":"#REF!"}},{"$f":"#REF!","v":{"$error":"#REF!"}},{"$f":"#REF!","v":{"$error":"#REF!"}},{"$f":"#REF!","v":{"$error":"#REF!"}},{"$f":"#REF!","v":{"$error":"#REF!"}},{"$f":"#REF!","v":{"$error":"#REF!"}},{"$f":"#REF!","v":{"$error":"#REF!"}},{"$f":"#REF!","v":{"$error":"#REF!"}},{"$f":"#REF!","v":{"$error":"#REF!"}},{"$f":"#REF!","v":{"$error":"#REF!"}},{"$f":"#REF!","v":{"$error":"#REF!"}},{"$f":"#REF!","v":{"$error":"#REF!"}},{"$f":"#REF!","v":{"$error":"#REF!"}},{"$f":"#REF!","v":{"$error":"#REF!"}},{"$f":"#REF!","v":{"$error":"#REF!"}}]
[200,{"$f":"#REF!","v":{"$error":"#REF!"}},{"$f":"#REF!","v":{"$error":"#REF!"}},{"$f":"#REF!","v":{"$error":"#REF!"}},{"$f":"#REF!","v":{"$error":"#REF!"}},{"$f":"#REF!","v":{"$error":"#REF!"}},{"$f":"#REF!","v":{"$error":"#REF!"}},{"$f":"#REF!","v":{"$error":"#REF!"}},{"$f":"#REF!","v":{"$error":"#REF!"}},{"$f":"#REF!","v":{"$error":"#REF!"}},{"$f":"#REF!","v":{"$error":"#REF!"}},{"$f":"#REF!","v":{"$error":"#REF!"}},{"$f":"#REF!","v":{"$error":"#REF!"}},{"$f":"#REF!","v":{"$error":"#REF!"}},{"$f":"#REF!","v":{"$error":"#REF!"}},{"$f":"#REF!","v":{"$error":"#REF!"}},{"$f":"#REF!","v":{"$error":"#REF!"}},{"$f":"#REF!","v":{"$error":"#REF!"}},{"$f":"#REF!","v":{"$error":"#REF!"}},{"$f":"#REF!","v":{"$error":"#REF!"}},{"$f":"#REF!","v":{"$error":"#REF!"}},{"$f":"#REF!","v":{"$error":"#REF!"}},{"$f":"#REF!","v":{"$error":"#REF!"}}]
[210,{"$f":"#REF!","v":{"$error":"#REF!"}},{"$f":"#REF!","v":{"$error":"#REF!"}},{"$f":"#REF!","v":{"$error":"#REF!"}},{"$f":"#REF!","v":{"$error":"#REF!"}},{"$f":"#REF!","v":{"$error":"#REF!"}},{"$f":"#REF!","v":{"$error":"#REF!"}},{"$f":"#REF!","v":{"$error":"#REF!"}},{"$f":"#REF!","v":{"$error":"#REF!"}},{"$f":"#REF!","v":{"$error":"#REF!"}},{"$f":"#REF!","v":{"$error":"#REF!"}},{"$f":"#REF!","v":{"$error":"#REF!"}},{"$f":"#REF!","v":{"$error":"#REF!"}},{"$f":"#REF!","v":{"$error":"#REF!"}},{"$f":"#REF!","v":{"$error":"#REF!"}},{"$f":"#REF!","v":{"$error":"#REF!"}},{"$f":"#REF!","v":{"$error":"#REF!"}},{"$f":"#REF!","v":{"$error":"#REF!"}},{"$f":"#REF!","v":{"$error":"#REF!"}},{"$f":"#REF!","v":{"$error":"#REF!"}},{"$f":"#REF!","v":{"$error":"#REF!"}},{"$f":"#REF!","v":{"$error":"#REF!"}},{"$f":"#REF!","v":{"$error":"#REF!"}}]
[220,{"$f":"#REF!","v":{"$error":"#REF!"}},{"$f":"#REF!","v":{"$error":"#REF!"}},{"$f":"#REF!","v":{"$error":"#REF!"}},{"$f":"#REF!","v":{"$error":"#REF!"}},{"$f":"#REF!","v":{"$error":"#REF!"}},{"$f":"#REF!","v":{"$error":"#REF!"}},{"$f":"#REF!","v":{"$error":"#REF!"}},{"$f":"#REF!","v":{"$error":"#REF!"}},{"$f":"#REF!","v":{"$error":"#REF!"}},{"$f":"#REF!","v":{"$error":"#REF!"}},{"$f":"#REF!","v":{"$error":"#REF!"}},{"$f":"#REF!","v":{"$error":"#REF!"}},{"$f":"#REF!","v":{"$error":"#REF!"}},{"$f":"#REF!","v":{"$error":"#REF!"}},{"$f":"#REF!","v":{"$error":"#REF!"}},{"$f":"#REF!","v":{"$error":"#REF!"}},{"$f":"#REF!","v":{"$error":"#REF!"}},{"$f":"#REF!","v":{"$error":"#REF!"}},{"$f":"#REF!","v":{"$error":"#REF!"}},{"$f":"#REF!","v":{"$error":"#REF!"}},{"$f":"#REF!","v":{"$error":"#REF!"}},{"$f":"#REF!","v":{"$error":"#REF!"}}]
[230,{"$f":"#REF!","v":{"$error":"#REF!"}},{"$f":"#REF!","v":{"$error":"#REF!"}},{"$f":"#REF!","v":{"$error":"#REF!"}},{"$f":"#REF!","v":{"$error":"#REF!"}},{"$f":"#REF!","v":{"$error":"#REF!"}},{"$f":"#REF!","v":{"$error":"#REF!"}},{"$f":"#REF!","v":{"$error":"#REF!"}},{"$f":"#REF!","v":{"$error":"#REF!"}},{"$f":"#REF!","v":{"$error":"#REF!"}},{"$f":"#REF!","v":{"$error":"#REF!"}},{"$f":"#REF!","v":{"$error":"#REF!"}},{"$f":"#REF!","v":{"$error":"#REF!"}},{"$f":"#REF!","v":{"$error":"#REF!"}},{"$f":"#REF!","v":{"$error":"#REF!"}},{"$f":"#REF!","v":{"$error":"#REF!"}},{"$f":"#REF!","v":{"$error":"#REF!"}},{"$f":"#REF!","v":{"$error":"#REF!"}},{"$f":"#REF!","v":{"$error":"#REF!"}},{"$f":"#REF!","v":{"$error":"#REF!"}},{"$f":"#REF!","v":{"$error":"#REF!"}},{"$f":"#REF!","v":{"$error":"#REF!"}},{"$f":"#REF!","v":{"$error":"#REF!"}}]
[240,{"$f":"#REF!","v":{"$error":"#REF!"}},{"$f":"#REF!","v":{"$error":"#REF!"}},{"$f":"#REF!","v":{"$error":"#REF!"}},{"$f":"#REF!","v":{"$error":"#REF!"}},{"$f":"#REF!","v":{"$error":"#REF!"}},{"$f":"#REF!","v":{"$error":"#REF!"}},{"$f":"#REF!","v":{"$error":"#REF!"}},{"$f":"#REF!","v":{"$error":"#REF!"}},{"$f":"#REF!","v":{"$error":"#REF!"}},{"$f":"#REF!","v":{"$error":"#REF!"}},{"$f":"#REF!","v":{"$error":"#REF!"}},{"$f":"#REF!","v":{"$error":"#REF!"}},{"$f":"#REF!","v":{"$error":"#REF!"}},{"$f":"#REF!","v":{"$error":"#REF!"}},{"$f":"#REF!","v":{"$error":"#REF!"}},{"$f":"#REF!","v":{"$error":"#REF!"}},{"$f":"#REF!","v":{"$error":"#REF!"}},{"$f":"#REF!","v":{"$error":"#REF!"}},{"$f":"#REF!","v":{"$error":"#REF!"}},{"$f":"#REF!","v":{"$error":"#REF!"}},{"$f":"#REF!","v":{"$error":"#REF!"}},{"$f":"#REF!","v":{"$error":"#REF!"}}]
[250,{"$f":"#REF!","v":{"$error":"#REF!"}},{"$f":"#REF!","v":{"$error":"#REF!"}},{"$f":"#REF!","v":{"$error":"#REF!"}},{"$f":"#REF!","v":{"$error":"#REF!"}},{"$f":"#REF!","v":{"$error":"#REF!"}},{"$f":"#REF!","v":{"$error":"#REF!"}},{"$f":"#REF!","v":{"$error":"#REF!"}},{"$f":"#REF!","v":{"$error":"#REF!"}},{"$f":"#REF!","v":{"$error":"#REF!"}},{"$f":"#REF!","v":{"$error":"#REF!"}},{"$f":"#REF!","v":{"$error":"#REF!"}},{"$f":"#REF!","v":{"$error":"#REF!"}},{"$f":"#REF!","v":{"$error":"#REF!"}},{"$f":"#REF!","v":{"$error":"#REF!"}},{"$f":"#REF!","v":{"$error":"#REF!"}},{"$f":"#REF!","v":{"$error":"#REF!"}},{"$f":"#REF!","v":{"$error":"#REF!"}},{"$f":"#REF!","v":{"$error":"#REF!"}},{"$f":"#REF!","v":{"$error":"#REF!"}},{"$f":"#REF!","v":{"$error":"#REF!"}},{"$f":"#REF!","v":{"$error":"#REF!"}},{"$f":"#REF!","v":{"$error":"#REF!"}}]
[260,{"$f":"#REF!","v":{"$error":"#REF!"}},{"$f":"#REF!","v":{"$error":"#REF!"}},{"$f":"#REF!","v":{"$error":"#REF!"}},{"$f":"#REF!","v":{"$error":"#REF!"}},{"$f":"#REF!","v":{"$error":"#REF!"}},{"$f":"#REF!","v":{"$error":"#REF!"}},{"$f":"#REF!","v":{"$error":"#REF!"}},{"$f":"#REF!","v":{"$error":"#REF!"}},{"$f":"#REF!","v":{"$error":"#REF!"}},{"$f":"#REF!","v":{"$error":"#REF!"}},{"$f":"#REF!","v":{"$error":"#REF!"}},{"$f":"#REF!","v":{"$error":"#REF!"}},{"$f":"#REF!","v":{"$error":"#REF!"}},{"$f":"#REF!","v":{"$error":"#REF!"}},{"$f":"#REF!","v":{"$error":"#REF!"}},{"$f":"#REF!","v":{"$error":"#REF!"}},{"$f":"#REF!","v":{"$error":"#REF!"}},{"$f":"#REF!","v":{"$error":"#REF!"}},{"$f":"#REF!","v":{"$error":"#REF!"}},{"$f":"#REF!","v":{"$error":"#REF!"}},{"$f":"#REF!","v":{"$error":"#REF!"}},{"$f":"#REF!","v":{"$error":"#REF!"}}]
[270,{"$f":"#REF!","v":{"$error":"#REF!"}},{"$f":"#REF!","v":{"$error":"#REF!"}},{"$f":"#REF!","v":{"$error":"#REF!"}},{"$f":"#REF!","v":{"$error":"#REF!"}},{"$f":"#REF!","v":{"$error":"#REF!"}},{"$f":"#REF!","v":{"$error":"#REF!"}},{"$f":"#REF!","v":{"$error":"#REF!"}},{"$f":"#REF!","v":{"$error":"#REF!"}},{"$f":"#REF!","v":{"$error":"#REF!"}},{"$f":"#REF!","v":{"$error":"#REF!"}},{"$f":"#REF!","v":{"$error":"#REF!"}},{"$f":"#REF!","v":{"$error":"#REF!"}},{"$f":"#REF!","v":{"$error":"#REF!"}},{"$f":"#REF!","v":{"$error":"#REF!"}},{"$f":"#REF!","v":{"$error":"#REF!"}},{"$f":"#REF!","v":{"$error":"#REF!"}},{"$f":"#REF!","v":{"$error":"#REF!"}},{"$f":"#REF!","v":{"$error":"#REF!"}},{"$f":"#REF!","v":{"$error":"#REF!"}},{"$f":"#REF!","v":{"$error":"#REF!"}},{"$f":"#REF!","v":{"$error":"#REF!"}},{"$f":"#REF!","v":{"$error":"#REF!"}}]
[280,{"$f":"#REF!","v":{"$error":"#REF!"}},{"$f":"#REF!","v":{"$error":"#REF!"}},{"$f":"#REF!","v":{"$error":"#REF!"}},{"$f":"#REF!","v":{"$error":"#REF!"}},{"$f":"#REF!","v":{"$error":"#REF!"}},{"$f":"#REF!","v":{"$error":"#REF!"}},{"$f":"#REF!","v":{"$error":"#REF!"}},{"$f":"#REF!","v":{"$error":"#REF!"}},{"$f":"#REF!","v":{"$error":"#REF!"}},{"$f":"#REF!","v":{"$error":"#REF!"}},{"$f":"#REF!","v":{"$error":"#REF!"}},{"$f":"#REF!","v":{"$error":"#REF!"}},{"$f":"#REF!","v":{"$error":"#REF!"}},{"$f":"#REF!","v":{"$error":"#REF!"}},{"$f":"#REF!","v":{"$error":"#REF!"}},{"$f":"#REF!","v":{"$error":"#REF!"}},{"$f":"#REF!","v":{"$error":"#REF!"}},{"$f":"#REF!","v":{"$error":"#REF!"}},{"$f":"#REF!","v":{"$error":"#REF!"}},{"$f":"#REF!","v":{"$error":"#REF!"}},{"$f":"#REF!","v":{"$error":"#REF!"}},{"$f":"#REF!","v":{"$error":"#REF!"}}]
[290,{"$f":"#REF!","v":{"$error":"#REF!"}},{"$f":"#REF!","v":{"$error":"#REF!"}},{"$f":"#REF!","v":{"$error":"#REF!"}},{"$f":"#REF!","v":{"$error":"#REF!"}},{"$f":"#REF!","v":{"$error":"#REF!"}},{"$f":"#REF!","v":{"$error":"#REF!"}},{"$f":"#REF!","v":{"$error":"#REF!"}},{"$f":"#REF!","v":{"$error":"#REF!"}},{"$f":"#REF!","v":{"$error":"#REF!"}},{"$f":"#REF!","v":{"$error":"#REF!"}},{"$f":"#REF!","v":{"$error":"#REF!"}},{"$f":"#REF!","v":{"$error":"#REF!"}},{"$f":"#REF!","v":{"$error":"#REF!"}},{"$f":"#REF!","v":{"$error":"#REF!"}},{"$f":"#REF!","v":{"$error":"#REF!"}},{"$f":"#REF!","v":{"$error":"#REF!"}},{"$f":"#REF!","v":{"$error":"#REF!"}},{"$f":"#REF!","v":{"$error":"#REF!"}},{"$f":"#REF!","v":{"$error":"#REF!"}},{"$f":"#REF!","v":{"$error":"#REF!"}},{"$f":"#REF!","v":{"$error":"#REF!"}},{"$f":"#REF!","v":{"$error":"#REF!"}}]
[300,{"$f":"#REF!","v":{"$error":"#REF!"}},{"$f":"#REF!","v":{"$error":"#REF!"}},{"$f":"#REF!","v":{"$error":"#REF!"}},{"$f":"#REF!","v":{"$error":"#REF!"}},{"$f":"#REF!","v":{"$error":"#REF!"}},{"$f":"#REF!","v":{"$error":"#REF!"}},{"$f":"#REF!","v":{"$error":"#REF!"}},{"$f":"#REF!","v":{"$error":"#REF!"}},{"$f":"#REF!","v":{"$error":"#REF!"}},{"$f":"#REF!","v":{"$error":"#REF!"}},{"$f":"#REF!","v":{"$error":"#REF!"}},{"$f":"#REF!","v":{"$error":"#REF!"}},{"$f":"#REF!","v":{"$error":"#REF!"}},{"$f":"#REF!","v":{"$error":"#REF!"}},{"$f":"#REF!","v":{"$error":"#REF!"}},{"$f":"#REF!","v":{"$error":"#REF!"}},{"$f":"#REF!","v":{"$error":"#REF!"}},{"$f":"#REF!","v":{"$error":"#REF!"}},{"$f":"#REF!","v":{"$error":"#REF!"}},{"$f":"#REF!","v":{"$error":"#REF!"}},{"$f":"#REF!","v":{"$error":"#REF!"}},{"$f":"#REF!","v":{"$error":"#REF!"}}]
[310,{"$f":"#REF!","v":{"$error":"#REF!"}},{"$f":"#REF!","v":{"$error":"#REF!"}},{"$f":"#REF!","v":{"$error":"#REF!"}},{"$f":"#REF!","v":{"$error":"#REF!"}},{"$f":"#REF!","v":{"$error":"#REF!"}},{"$f":"#REF!","v":{"$error":"#REF!"}},{"$f":"#REF!","v":{"$error":"#REF!"}},{"$f":"#REF!","v":{"$error":"#REF!"}},{"$f":"#REF!","v":{"$error":"#REF!"}},{"$f":"#REF!","v":{"$error":"#REF!"}},{"$f":"#REF!","v":{"$error":"#REF!"}},{"$f":"#REF!","v":{"$error":"#REF!"}},{"$f":"#REF!","v":{"$error":"#REF!"}},{"$f":"#REF!","v":{"$error":"#REF!"}},{"$f":"#REF!","v":{"$error":"#REF!"}},{"$f":"#REF!","v":{"$error":"#REF!"}},{"$f":"#REF!","v":{"$error":"#REF!"}},{"$f":"#REF!","v":{"$error":"#REF!"}},{"$f":"#REF!","v":{"$error":"#REF!"}},{"$f":"#REF!","v":{"$error":"#REF!"}},{"$f":"#REF!","v":{"$error":"#REF!"}},{"$f":"#REF!","v":{"$error":"#REF!"}}]
[320,{"$f":"#REF!","v":{"$error":"#REF!"}},{"$f":"#REF!","v":{"$error":"#REF!"}},{"$f":"#REF!","v":{"$error":"#REF!"}},{"$f":"#REF!","v":{"$error":"#REF!"}},{"$f":"#REF!","v":{"$error":"#REF!"}},{"$f":"#REF!","v":{"$error":"#REF!"}},{"$f":"#REF!","v":{"$error":"#REF!"}},{"$f":"#REF!","v":{"$error":"#REF!"}},{"$f":"#REF!","v":{"$error":"#REF!"}},{"$f":"#REF!","v":{"$error":"#REF!"}},{"$f":"#REF!","v":{"$error":"#REF!"}},{"$f":"#REF!","v":{"$error":"#REF!"}},{"$f":"#REF!","v":{"$error":"#REF!"}},{"$f":"#REF!","v":{"$error":"#REF!"}},{"$f":"#REF!","v":{"$error":"#REF!"}},{"$f":"#REF!","v":{"$error":"#REF!"}},{"$f":"#REF!","v":{"$error":"#REF!"}},{"$f":"#REF!","v":{"$error":"#REF!"}},{"$f":"#REF!","v":{"$error":"#REF!"}},{"$f":"#REF!","v":{"$error":"#REF!"}},{"$f":"#REF!","v":{"$error":"#REF!"}},{"$f":"#REF!","v":{"$error":"#REF!"}}]
[330,{"$f":"#REF!","v":{"$error":"#REF!"}},{"$f":"#REF!","v":{"$error":"#REF!"}},{"$f":"#REF!","v":{"$error":"#REF!"}},{"$f":"#REF!","v":{"$error":"#REF!"}},{"$f":"#REF!","v":{"$error":"#REF!"}},{"$f":"#REF!","v":{"$error":"#REF!"}},{"$f":"#REF!","v":{"$error":"#REF!"}},{"$f":"#REF!","v":{"$error":"#REF!"}},{"$f":"#REF!","v":{"$error":"#REF!"}},{"$f":"#REF!","v":{"$error":"#REF!"}},{"$f":"#REF!","v":{"$error":"#REF!"}},{"$f":"#REF!","v":{"$error":"#REF!"}},{"$f":"#REF!","v":{"$error":"#REF!"}},{"$f":"#REF!","v":{"$error":"#REF!"}},{"$f":"#REF!","v":{"$error":"#REF!"}},{"$f":"#REF!","v":{"$error":"#REF!"}},{"$f":"#REF!","v":{"$error":"#REF!"}},{"$f":"#REF!","v":{"$error":"#REF!"}},{"$f":"#REF!","v":{"$error":"#REF!"}},{"$f":"#REF!","v":{"$error":"#REF!"}},{"$f":"#REF!","v":{"$error":"#REF!"}},{"$f":"#REF!","v":{"$error":"#REF!"}}]
[340,{"$f":"#REF!","v":{"$error":"#REF!"}},{"$f":"#REF!","v":{"$error":"#REF!"}},{"$f":"#REF!","v":{"$error":"#REF!"}},{"$f":"#REF!","v":{"$error":"#REF!"}},{"$f":"#REF!","v":{"$error":"#REF!"}},{"$f":"#REF!","v":{"$error":"#REF!"}},{"$f":"#REF!","v":{"$error":"#REF!"}},{"$f":"#REF!","v":{"$error":"#REF!"}},{"$f":"#REF!","v":{"$error":"#REF!"}},{"$f":"#REF!","v":{"$error":"#REF!"}},{"$f":"#REF!","v":{"$error":"#REF!"}},{"$f":"#REF!","v":{"$error":"#REF!"}},{"$f":"#REF!","v":{"$error":"#REF!"}},{"$f":"#REF!","v":{"$error":"#REF!"}},{"$f":"#REF!","v":{"$error":"#REF!"}},{"$f":"#REF!","v":{"$error":"#REF!"}},{"$f":"#REF!","v":{"$error":"#REF!"}},{"$f":"#REF!","v":{"$error":"#REF!"}},{"$f":"#REF!","v":{"$error":"#REF!"}},{"$f":"#REF!","v":{"$error":"#REF!"}},{"$f":"#REF!","v":{"$error":"#REF!"}},{"$f":"#REF!","v":{"$error":"#REF!"}}]
[350,{"$f":"#REF!","v":{"$error":"#REF!"}},{"$f":"#REF!","v":{"$error":"#REF!"}},{"$f":"#REF!","v":{"$error":"#REF!"}},{"$f":"#REF!","v":{"$error":"#REF!"}},{"$f":"#REF!","v":{"$error":"#REF!"}},{"$f":"#REF!","v":{"$error":"#REF!"}},{"$f":"#REF!","v":{"$error":"#REF!"}},{"$f":"#REF!","v":{"$error":"#REF!"}},{"$f":"#REF!","v":{"$error":"#REF!"}},{"$f":"#REF!","v":{"$error":"#REF!"}},{"$f":"#REF!","v":{"$error":"#REF!"}},{"$f":"#REF!","v":{"$error":"#REF!"}},{"$f":"#REF!","v":{"$error":"#REF!"}},{"$f":"#REF!","v":{"$error":"#REF!"}},{"$f":"#REF!","v":{"$error":"#REF!"}},{"$f":"#REF!","v":{"$error":"#REF!"}},{"$f":"#REF!","v":{"$error":"#REF!"}},{"$f":"#REF!","v":{"$error":"#REF!"}},{"$f":"#REF!","v":{"$error":"#REF!"}},{"$f":"#REF!","v":{"$error":"#REF!"}},{"$f":"#REF!","v":{"$error":"#REF!"}},{"$f":"#REF!","v":{"$error":"#REF!"}}]
[360,{"$f":"#REF!","v":{"$error":"#REF!"}},{"$f":"#REF!","v":{"$error":"#REF!"}},{"$f":"#REF!","v":{"$error":"#REF!"}},{"$f":"#REF!","v":{"$error":"#REF!"}},{"$f":"#REF!","v":{"$error":"#REF!"}},{"$f":"#REF!","v":{"$error":"#REF!"}},{"$f":"#REF!","v":{"$error":"#REF!"}},{"$f":"#REF!","v":{"$error":"#REF!"}},{"$f":"#REF!","v":{"$error":"#REF!"}},{"$f":"#REF!","v":{"$error":"#REF!"}},{"$f":"#REF!","v":{"$error":"#REF!"}},{"$f":"#REF!","v":{"$error":"#REF!"}},{"$f":"#REF!","v":{"$error":"#REF!"}},{"$f":"#REF!","v":{"$error":"#REF!"}},{"$f":"#REF!","v":{"$error":"#REF!"}},{"$f":"#REF!","v":{"$error":"#REF!"}},{"$f":"#REF!","v":{"$error":"#REF!"}},{"$f":"#REF!","v":{"$error":"#REF!"}},{"$f":"#REF!","v":{"$error":"#REF!"}},{"$f":"#REF!","v":{"$error":"#REF!"}},{"$f":"#REF!","v":{"$error":"#REF!"}},{"$f":"#REF!","v":{"$error":"#REF!"}}]
[370,{"$f":"#REF!","v":{"$error":"#REF!"}},{"$f":"#REF!","v":{"$error":"#REF!"}},{"$f":"#REF!","v":{"$error":"#REF!"}},{"$f":"#REF!","v":{"$error":"#REF!"}},{"$f":"#REF!","v":{"$error":"#REF!"}},{"$f":"#REF!","v":{"$error":"#REF!"}},{"$f":"#REF!","v":{"$error":"#REF!"}},{"$f":"#REF!","v":{"$error":"#REF!"}},{"$f":"#REF!","v":{"$error":"#REF!"}},{"$f":"#REF!","v":{"$error":"#REF!"}},{"$f":"#REF!","v":{"$error":"#REF!"}},{"$f":"#REF!","v":{"$error":"#REF!"}},{"$f":"#REF!","v":{"$error":"#REF!"}},{"$f":"#REF!","v":{"$error":"#REF!"}},{"$f":"#REF!","v":{"$error":"#REF!"}},{"$f":"#REF!","v":{"$error":"#REF!"}},{"$f":"#REF!","v":{"$error":"#REF!"}},{"$f":"#REF!","v":{"$error":"#REF!"}},{"$f":"#REF!","v":{"$error":"#REF!"}},{"$f":"#REF!","v":{"$error":"#REF!"}},{"$f":"#REF!","v":{"$error":"#REF!"}},{"$f":"#REF!","v":{"$error":"#REF!"}}]
[380,{"$f":"#REF!","v":{"$error":"#REF!"}},{"$f":"#REF!","v":{"$error":"#REF!"}},{"$f":"#REF!","v":{"$error":"#REF!"}},{"$f":"#REF!","v":{"$error":"#REF!"}},{"$f":"#REF!","v":{"$error":"#REF!"}},{"$f":"#REF!","v":{"$error":"#REF!"}},{"$f":"#REF!","v":{"$error":"#REF!"}},{"$f":"#REF!","v":{"$error":"#REF!"}},{"$f":"#REF!","v":{"$error":"#REF!"}},{"$f":"#REF!","v":{"$error":"#REF!"}},{"$f":"#REF!","v":{"$error":"#REF!"}},{"$f":"#REF!","v":{"$error":"#REF!"}},{"$f":"#REF!","v":{"$error":"#REF!"}},{"$f":"#REF!","v":{"$error":"#REF!"}},{"$f":"#REF!","v":{"$error":"#REF!"}},{"$f":"#REF!","v":{"$error":"#REF!"}},{"$f":"#REF!","v":{"$error":"#REF!"}},{"$f":"#REF!","v":{"$error":"#REF!"}},{"$f":"#REF!","v":{"$error":"#REF!"}},{"$f":"#REF!","v":{"$error":"#REF!"}},{"$f":"#REF!","v":{"$error":"#REF!"}},{"$f":"#REF!","v":{"$error":"#REF!"}}]
[390,{"$f":"#REF!","v":{"$error":"#REF!"}},{"$f":"#REF!","v":{"$error":"#REF!"}},{"$f":"#REF!","v":{"$error":"#REF!"}},{"$f":"#REF!","v":{"$error":"#REF!"}},{"$f":"#REF!","v":{"$error":"#REF!"}},{"$f":"#REF!","v":{"$error":"#REF!"}},{"$f":"#REF!","v":{"$error":"#REF!"}},{"$f":"#REF!","v":{"$error":"#REF!"}},{"$f":"#REF!","v":{"$error":"#REF!"}},{"$f":"#REF!","v":{"$error":"#REF!"}},{"$f":"#REF!","v":{"$error":"#REF!"}},{"$f":"#REF!","v":{"$error":"#REF!"}},{"$f":"#REF!","v":{"$error":"#REF!"}},{"$f":"#REF!","v":{"$error":"#REF!"}},{"$f":"#REF!","v":{"$error":"#REF!"}},{"$f":"#REF!","v":{"$error":"#REF!"}},{"$f":"#REF!","v":{"$error":"#REF!"}},{"$f":"#REF!","v":{"$error":"#REF!"}},{"$f":"#REF!","v":{"$error":"#REF!"}},{"$f":"#REF!","v":{"$error":"#REF!"}},{"$f":"#REF!","v":{"$error":"#REF!"}},{"$f":"#REF!","v":{"$error":"#REF!"}}]
[400,{"$f":"#REF!","v":{"$error":"#REF!"}},{"$f":"#REF!","v":{"$error":"#REF!"}},{"$f":"#REF!","v":{"$error":"#REF!"}},{"$f":"#REF!","v":{"$error":"#REF!"}},{"$f":"#REF!","v":{"$error":"#REF!"}},{"$f":"#REF!","v":{"$error":"#REF!"}},{"$f":"#REF!","v":{"$error":"#REF!"}},{"$f":"#REF!","v":{"$error":"#REF!"}},{"$f":"#REF!","v":{"$error":"#REF!"}},{"$f":"#REF!","v":{"$error":"#REF!"}},{"$f":"#REF!","v":{"$error":"#REF!"}},{"$f":"#REF!","v":{"$error":"#REF!"}},{"$f":"#REF!","v":{"$error":"#REF!"}},{"$f":"#REF!","v":{"$error":"#REF!"}},{"$f":"#REF!","v":{"$error":"#REF!"}},{"$f":"#REF!","v":{"$error":"#REF!"}},{"$f":"#REF!","v":{"$error":"#REF!"}},{"$f":"#REF!","v":{"$error":"#REF!"}},{"$f":"#REF!","v":{"$error":"#REF!"}},{"$f":"#REF!","v":{"$error":"#REF!"}},{"$f":"#REF!","v":{"$error":"#REF!"}},{"$f":"#REF!","v":{"$error":"#REF!"}}]

{"sheet":"RIBS3","index":5,"n_rows":38,"n_cols":23,"rows_kept":38,"hidden":true}
[null,40,50,60,70,80,90,100,110,120,130,140,150,160,170,180,190,200,210,220,230,240,250]
[40,{"$f":"#REF!","v":{"$error":"#REF!"}},{"$f":"#REF!","v":{"$error":"#REF!"}},{"$f":"#REF!","v":{"$error":"#REF!"}},{"$f":"#REF!","v":{"$error":"#REF!"}},{"$f":"#REF!","v":{"$error":"#REF!"}},{"$f":"#REF!","v":{"$error":"#REF!"}},{"$f":"#REF!","v":{"$error":"#REF!"}},{"$f":"#REF!","v":{"$error":"#REF!"}},{"$f":"#REF!","v":{"$error":"#REF!"}},{"$f":"#REF!","v":{"$error":"#REF!"}},{"$f":"#REF!","v":{"$error":"#REF!"}},{"$f":"#REF!","v":{"$error":"#REF!"}},{"$f":"#REF!","v":{"$error":"#REF!"}},{"$f":"#REF!","v":{"$error":"#REF!"}},{"$f":"#REF!","v":{"$error":"#REF!"}},{"$f":"#REF!","v":{"$error":"#REF!"}},{"$f":"#REF!","v":{"$error":"#REF!"}},{"$f":"#REF!","v":{"$error":"#REF!"}},{"$f":"#REF!","v":{"$error":"#REF!"}},{"$f":"#REF!","v":{"$error":"#REF!"}},{"$f":"#REF!","v":{"$error":"#REF!"}},{"$f":"#REF!","v":{"$error":"#REF!"}}]
[50,{"$f":"#REF!","v":{"$error":"#REF!"}},{"$f":"#REF!","v":{"$error":"#REF!"}},{"$f":"#REF!","v":{"$error":"#REF!"}},{"$f":"#REF!","v":{"$error":"#REF!"}},{"$f":"#REF!","v":{"$error":"#REF!"}},{"$f":"#REF!","v":{"$error":"#REF!"}},{"$f":"#REF!","v":{"$error":"#REF!"}},{"$f":"#REF!","v":{"$error":"#REF!"}},{"$f":"#REF!","v":{"$error":"#REF!"}},{"$f":"#REF!","v":{"$error":"#REF!"}},{"$f":"#REF!","v":{"$error":"#REF!"}},{"$f":"#REF!","v":{"$error":"#REF!"}},{"$f":"#REF!","v":{"$error":"#REF!"}},{"$f":"#REF!","v":{"$error":"#REF!"}},{"$f":"#REF!","v":{"$error":"#REF!"}},{"$f":"#REF!","v":{"$error":"#REF!"}},{"$f":"#REF!","v":{"$error":"#REF!"}},{"$f":"#REF!","v":{"$error":"#REF!"}},{"$f":"#REF!","v":{"$error":"#REF!"}},{"$f":"#REF!","v":{"$error":"#REF!"}},{"$f":"#REF!","v":{"$error":"#REF!"}},{"$f":"#REF!","v":{"$error":"#REF!"}}]
[60,{"$f":"#REF!","v":{"$error":"#REF!"}},{"$f":"#REF!","v":{"$error":"#REF!"}},{"$f":"#REF!","v":{"$error":"#REF!"}},{"$f":"#REF!","v":{"$error":"#REF!"}},{"$f":"#REF!","v":{"$error":"#REF!"}},{"$f":"#REF!","v":{"$error":"#REF!"}},{"$f":"#REF!","v":{"$error":"#REF!"}},{"$f":"#REF!","v":{"$error":"#REF!"}},{"$f":"#REF!","v":{"$error":"#REF!"}},{"$f":"#REF!","v":{"$error":"#REF!"}},{"$f":"#REF!","v":{"$error":"#REF!"}},{"$f":"#REF!","v":{"$error":"#REF!"}},{"$f":"#REF!","v":{"$error":"#REF!"}},{"$f":"#REF!","v":{"$error":"#REF!"}},{"$f":"#REF!","v":{"$error":"#REF!"}},{"$f":"#REF!","v":{"$error":"#REF!"}},{"$f":"#REF!","v":{"$error":"#REF!"}},{"$f":"#REF!","v":{"$error":"#REF!"}},{"$f":"#REF!","v":{"$error":"#REF!"}},{"$f":"#REF!","v":{"$error":"#REF!"}},{"$f":"#REF!","v":{"$error":"#REF!"}},{"$f":"#REF!","v":{"$error":"#REF!"}}]
[70,{"$f":"#REF!","v":{"$error":"#REF!"}},{"$f":"#REF!","v":{"$error":"#REF!"}},{"$f":"#REF!","v":{"$error":"#REF!"}},{"$f":"#REF!","v":{"$error":"#REF!"}},{"$f":"#REF!","v":{"$error":"#REF!"}},{"$f":"#REF!","v":{"$error":"#REF!"}},{"$f":"#REF!","v":{"$error":"#REF!"}},{"$f":"#REF!","v":{"$error":"#REF!"}},{"$f":"#REF!","v":{"$error":"#REF!"}},{"$f":"#REF!","v":{"$error":"#REF!"}},{"$f":"#REF!","v":{"$error":"#REF!"}},{"$f":"#REF!","v":{"$error":"#REF!"}},{"$f":"#REF!","v":{"$error":"#REF!"}},{"$f":"#REF!","v":{"$error":"#REF!"}},{"$f":"#REF!","v":{"$error":"#REF!"}},{"$f":"#REF!","v":{"$error":"#REF!"}},{"$f":"#REF!","v":{"$error":"#REF!"}},{"$f":"#REF!","v":{"$error":"#REF!"}},{"$f":"#REF!","v":{"$error":"#REF!"}},{"$f":"#REF!","v":{"$error":"#REF!"}},{"$f":"#REF!","v":{"$error":"#REF!"}},{"$f":"#REF!","v":{"$error":"#REF!"}}]
[80,{"$f":"#REF!","v":{"$error":"#REF!"}},{"$f":"#REF!","v":{"$error":"#REF!"}},{"$f":"#REF!","v":{"$error":"#REF!"}},{"$f":"#REF!","v":{"$error":"#REF!"}},{"$f":"#REF!","v":{"$error":"#REF!"}},{"$f":"#REF!","v":{"$error":"#REF!"}},{"$f":"#REF!","v":{"$error":"#REF!"}},{"$f":"#REF!","v":{"$error":"#REF!"}},{"$f":"#REF!","v":{"$error":"#REF!"}},{"$f":"#REF!","v":{"$error":"#REF!"}},{"$f":"#REF!","v":{"$error":"#REF!"}},{"$f":"#REF!","v":{"$error":"#REF!"}},{"$f":"#REF!","v":{"$error":"#REF!"}},{"$f":"#REF!","v":{"$error":"#REF!"}},{"$f":"#REF!","v":{"$error":"#REF!"}},{"$f":"#REF!","v":{"$error":"#REF!"}},{"$f":"#REF!","v":{"$error":"#REF!"}},{"$f":"#REF!","v":{"$error":"#REF!"}},{"$f":"#REF!","v":{"$error":"#REF!"}},{"$f":"#REF!","v":{"$error":"#REF!"}},{"$f":"#REF!","v":{"$error":"#REF!"}},{"$f":"#REF!","v":{"$error":"#REF!"}}]
[90,{"$f":"#REF!","v":{"$error":"#REF!"}},{"$f":"#REF!","v":{"$error":"#REF!"}},{"$f":"#REF!","v":{"$error":"#REF!"}},{"$f":"#REF!","v":{"$error":"#REF!"}},{"$f":"#REF!","v":{"$error":"#REF!"}},{"$f":"#REF!","v":{"$error":"#REF!"}},{"$f":"#REF!","v":{"$error":"#REF!"}},{"$f":"#REF!","v":{"$error":"#REF!"}},{"$f":"#REF!","v":{"$error":"#REF!"}},{"$f":"#REF!","v":{"$error":"#REF!"}},{"$f":"#REF!","v":{"$error":"#REF!"}},{"$f":"#REF!","v":{"$error":"#REF!"}},{"$f":"#REF!","v":{"$error":"#REF!"}},{"$f":"#REF!","v":{"$error":"#REF!"}},{"$f":"#REF!","v":{"$error":"#REF!"}},{"$f":"#REF!","v":{"$error":"#REF!"}},{"$f":"#REF!","v":{"$error":"#REF!"}},{"$f":"#REF!","v":{"$error":"#REF!"}},{"$f":"#REF!","v":{"$error":"#REF!"}},{"$f":"#REF!","v":{"$error":"#REF!"}},{"$f":"#REF!","v":{"$error":"#REF!"}},{"$f":"#REF!","v":{"$error":"#REF!"}}]
[100,{"$f":"#REF!","v":{"$error":"#REF!"}},{"$f":"#REF!","v":{"$error":"#REF!"}},{"$f":"#REF!","v":{"$error":"#REF!"}},{"$f":"#REF!","v":{"$error":"#REF!"}},{"$f":"#REF!","v":{"$error":"#REF!"}},{"$f":"#REF!","v":{"$error":"#REF!"}},{"$f":"#REF!","v":{"$error":"#REF!"}},{"$f":"#REF!","v":{"$error":"#REF!"}},{"$f":"#REF!","v":{"$error":"#REF!"}},{"$f":"#REF!","v":{"$error":"#REF!"}},{"$f":"#REF!","v":{"$error":"#REF!"}},{"$f":"#REF!","v":{"$error":"#REF!"}},{"$f":"#REF!","v":{"$error":"#REF!"}},{"$f":"#REF!","v":{"$error":"#REF!"}},{"$f":"#REF!","v":{"$error":"#REF!"}},{"$f":"#REF!","v":{"$error":"#REF!"}},{"$f":"#REF!","v":{"$error":"#REF!"}},{"$f":"#REF!","v":{"$error":"#REF!"}},{"$f":"#REF!","v":{"$error":"#REF!"}},{"$f":"#REF!","v":{"$error":"#REF!"}},{"$f":"#REF!","v":{"$error":"#REF!"}},{"$f":"#REF!","v":{"$error":"#REF!"}}]
[110,{"$f":"#REF!","v":{"$error":"#REF!"}},{"$f":"#REF!","v":{"$error":"#REF!"}},{"$f":"#REF!","v":{"$error":"#REF!"}},{"$f":"#REF!","v":{"$error":"#REF!"}},{"$f":"#REF!","v":{"$error":"#REF!"}},{"$f":"#REF!","v":{"$error":"#REF!"}},{"$f":"#REF!","v":{"$error":"#REF!"}},{"$f":"#REF!","v":{"$error":"#REF!"}},{"$f":"#REF!","v":{"$error":"#REF!"}},{"$f":"#REF!","v":{"$error":"#REF!"}},{"$f":"#REF!","v":{"$error":"#REF!"}},{"$f":"#REF!","v":{"$error":"#REF!"}},{"$f":"#REF!","v":{"$error":"#REF!"}},{"$f":"#REF!","v":{"$error":"#REF!"}},{"$f":"#REF!","v":{"$error":"#REF!"}},{"$f":"#REF!","v":{"$error":"#REF!"}},{"$f":"#REF!","v":{"$error":"#REF!"}},{"$f":"#REF!","v":{"$error":"#REF!"}},{"$f":"#REF!","v":{"$error":"#REF!"}},{"$f":"#REF!","v":{"$error":"#REF!"}},{"$f":"#REF!","v":{"$error":"#REF!"}},{"$f":"#REF!","v":{"$error":"#REF!"}}]
[120,{"$f":"#REF!","v":{"$error":"#REF!"}},{"$f":"#REF!","v":{"$error":"#REF!"}},{"$f":"#REF!","v":{"$error":"#REF!"}},{"$f":"#REF!","v":{"$error":"#REF!"}},{"$f":"#REF!","v":{"$error":"#REF!"}},{"$f":"#REF!","v":{"$error":"#REF!"}},{"$f":"#REF!","v":{"$error":"#REF!"}},{"$f":"#REF!","v":{"$error":"#REF!"}},{"$f":"#REF!","v":{"$error":"#REF!"}},{"$f":"#REF!","v":{"$error":"#REF!"}},{"$f":"#REF!","v":{"$error":"#REF!"}},{"$f":"#REF!","v":{"$error":"#REF!"}},{"$f":"#REF!","v":{"$error":"#REF!"}},{"$f":"#REF!","v":{"$error":"#REF!"}},{"$f":"#REF!","v":{"$error":"#REF!"}},{"$f":"#REF!","v":{"$error":"#REF!"}},{"$f":"#REF!","v":{"$error":"#REF!"}},{"$f":"#REF!","v":{"$error":"#REF!"}},{"$f":"#REF!","v":{"$error":"#REF!"}},{"$f":"#REF!","v":{"$error":"#REF!"}},{"$f":"#REF!","v":{"$error":"#REF!"}},{"$f":"#REF!","v":{"$error":"#REF!"}}]
[130,{"$f":"#REF!","v":{"$error":"#REF!"}},{"$f":"#REF!","v":{"$error":"#REF!"}},{"$f":"#REF!","v":{"$error":"#REF!"}},{"$f":"#REF!","v":{"$error":"#REF!"}},{"$f":"#REF!","v":{"$error":"#REF!"}},{"$f":"#REF!","v":{"$error":"#REF!"}},{"$f":"#REF!","v":{"$error":"#REF!"}},{"$f":"#REF!","v":{"$error":"#REF!"}},{"$f":"#REF!","v":{"$error":"#REF!"}},{"$f":"#REF!","v":{"$error":"#REF!"}},{"$f":"#REF!","v":{"$error":"#REF!"}},{"$f":"#REF!","v":{"$error":"#REF!"}},{"$f":"#REF!","v":{"$error":"#REF!"}},{"$f":"#REF!","v":{"$error":"#REF!"}},{"$f":"#REF!","v":{"$error":"#REF!"}},{"$f":"#REF!","v":{"$error":"#REF!"}},{"$f":"#REF!","v":{"$error":"#REF!"}},{"$f":"#REF!","v":{"$error":"#REF!"}},{"$f":"#REF!","v":{"$error":"#REF!"}},{"$f":"#REF!","v":{"$error":"#REF!"}},{"$f":"#REF!","v":{"$error":"#REF!"}},{"$f":"#REF!","v":{"$error":"#REF!"}}]
[140,{"$f":"#REF!","v":{"$error":"#REF!"}},{"$f":"#REF!","v":{"$error":"#REF!"}},{"$f":"#REF!","v":{"$error":"#REF!"}},{"$f":"#REF!","v":{"$error":"#REF!"}},{"$f":"#REF!","v":{"$error":"#REF!"}},{"$f":"#REF!","v":{"$error":"#REF!"}},{"$f":"#REF!","v":{"$error":"#REF!"}},{"$f":"#REF!","v":{"$error":"#REF!"}},{"$f":"#REF!","v":{"$error":"#REF!"}},{"$f":"#REF!","v":{"$error":"#REF!"}},{"$f":"#REF!","v":{"$error":"#REF!"}},{"$f":"#REF!","v":{"$error":"#REF!"}},{"$f":"#REF!","v":{"$error":"#REF!"}},{"$f":"#REF!","v":{"$error":"#REF!"}},{"$f":"#REF!","v":{"$error":"#REF!"}},{"$f":"#REF!","v":{"$error":"#REF!"}},{"$f":"#REF!","v":{"$error":"#REF!"}},{"$f":"#REF!","v":{"$error":"#REF!"}},{"$f":"#REF!","v":{"$error":"#REF!"}},{"$f":"#REF!","v":{"$error":"#REF!"}},{"$f":"#REF!","v":{"$error":"#REF!"}},{"$f":"#REF!","v":{"$error":"#REF!"}}]
[150,{"$f":"#REF!","v":{"$error":"#REF!"}},{"$f":"#REF!","v":{"$error":"#REF!"}},{"$f":"#REF!","v":{"$error":"#REF!"}},{"$f":"#REF!","v":{"$error":"#REF!"}},{"$f":"#REF!","v":{"$error":"#REF!"}},{"$f":"#REF!","v":{"$error":"#REF!"}},{"$f":"#REF!","v":{"$error":"#REF!"}},{"$f":"#REF!","v":{"$error":"#REF!"}},{"$f":"#REF!","v":{"$error":"#REF!"}},{"$f":"#REF!","v":{"$error":"#REF!"}},{"$f":"#REF!","v":{"$error":"#REF!"}},{"$f":"#REF!","v":{"$error":"#REF!"}},{"$f":"#REF!","v":{"$error":"#REF!"}},{"$f":"#REF!","v":{"$error":"#REF!"}},{"$f":"#REF!","v":{"$error":"#REF!"}},{"$f":"#REF!","v":{"$error":"#REF!"}},{"$f":"#REF!","v":{"$error":"#REF!"}},{"$f":"#REF!","v":{"$error":"#REF!"}},{"$f":"#REF!","v":{"$error":"#REF!"}},{"$f":"#REF!","v":{"$error":"#REF!"}},{"$f":"#REF!","v":{"$error":"#REF!"}},{"$f":"#REF!","v":{"$error":"#REF!"}}]
[160,{"$f":"#REF!","v":{"$error":"#REF!"}},{"$f":"#REF!","v":{"$error":"#REF!"}},{"$f":"#REF!","v":{"$error":"#REF!"}},{"$f":"#REF!","v":{"$error":"#REF!"}},{"$f":"#REF!","v":{"$error":"#REF!"}},{"$f":"#REF!","v":{"$error":"#REF!"}},{"$f":"#REF!","v":{"$error":"#REF!"}},{"$f":"#REF!","v":{"$error":"#REF!"}},{"$f":"#REF!","v":{"$error":"#REF!"}},{"$f":"#REF!","v":{"$error":"#REF!"}},{"$f":"#REF!","v":{"$error":"#REF!"}},{"$f":"#REF!","v":{"$error":"#REF!"}},{"$f":"#REF!","v":{"$error":"#REF!"}},{"$f":"#REF!","v":{"$error":"#REF!"}},{"$f":"#REF!","v":{"$error":"#REF!"}},{"$f":"#REF!","v":{"$error":"#REF!"}},{"$f":"#REF!","v":{"$error":"#REF!"}},{"$f":"#REF!","v":{"$error":"#REF!"}},{"$f":"#REF!","v":{"$error":"#REF!"}},{"$f":"#REF!","v":{"$error":"#REF!"}},{"$f":"#REF!","v":{"$error":"#REF!"}},{"$f":"#REF!","v":{"$error":"#REF!"}}]
[170,{"$f":"#REF!","v":{"$error":"#REF!"}},{"$f":"#REF!","v":{"$error":"#REF!"}},{"$f":"#REF!","v":{"$error":"#REF!"}},{"$f":"#REF!","v":{"$error":"#REF!"}},{"$f":"#REF!","v":{"$error":"#REF!"}},{"$f":"#REF!","v":{"$error":"#REF!"}},{"$f":"#REF!","v":{"$error":"#REF!"}},{"$f":"#REF!","v":{"$error":"#REF!"}},{"$f":"#REF!","v":{"$error":"#REF!"}},{"$f":"#REF!","v":{"$error":"#REF!"}},{"$f":"#REF!","v":{"$error":"#REF!"}},{"$f":"#REF!","v":{"$error":"#REF!"}},{"$f":"#REF!","v":{"$error":"#REF!"}},{"$f":"#REF!","v":{"$error":"#REF!"}},{"$f":"#REF!","v":{"$error":"#REF!"}},{"$f":"#REF!","v":{"$error":"#REF!"}},{"$f":"#REF!","v":{"$error":"#REF!"}},{"$f":"#REF!","v":{"$error":"#REF!"}},{"$f":"#REF!","v":{"$error":"#REF!"}},{"$f":"#REF!","v":{"$error":"#REF!"}},{"$f":"#REF!","v":{"$error":"#REF!"}},{"$f":"#REF!","v":{"$error":"#REF!"}}]
[180,{"$f":"#REF!","v":{"$error":"#REF!"}},{"$f":"#REF!","v":{"$error":"#REF!"}},{"$f":"#REF!","v":{"$error":"#REF!"}},{"$f":"#REF!","v":{"$error":"#REF!"}},{"$f":"#REF!","v":{"$error":"#REF!"}},{"$f":"#REF!","v":{"$error":"#REF!"}},{"$f":"#REF!","v":{"$error":"#REF!"}},{"$f":"#REF!","v":{"$error":"#REF!"}},{"$f":"#REF!","v":{"$error":"#REF!"}},{"$f":"#REF!","v":{"$error":"#REF!"}},{"$f":"#REF!","v":{"$error":"#REF!"}},{"$f":"#REF!","v":{"$error":"#REF!"}},{"$f":"#REF!","v":{"$error":"#REF!"}},{"$f":"#REF!","v":{"$error":"#REF!"}},{"$f":"#REF!","v":{"$error":"#REF!"}},{"$f":"#REF!","v":{"$error":"#REF!"}},{"$f":"#REF!","v":{"$error":"#REF!"}},{"$f":"#REF!","v":{"$error":"#REF!"}},{"$f":"#REF!","v":{"$error":"#REF!"}},{"$f":"#REF!","v":{"$error":"#REF!"}},{"$f":"#REF!","v":{"$error":"#REF!"}},{"$f":"#REF!","v":{"$error":"#REF!"}}]
[190,{"$f":"#REF!","v":{"$error":"#REF!"}},{"$f":"#REF!","v":{"$error":"#REF!"}},{"$f":"#REF!","v":{"$error":"#REF!"}},{"$f":"#REF!","v":{"$error":"#REF!"}},{"$f":"#REF!","v":{"$error":"#REF!"}},{"$f":"#REF!","v":{"$error":"#REF!"}},{"$f":"#REF!","v":{"$error":"#REF!"}},{"$f":"#REF!","v":{"$error":"#REF!"}},{"$f":"#REF!","v":{"$error":"#REF!"}},{"$f":"#REF!","v":{"$error":"#REF!"}},{"$f":"#REF!","v":{"$error":"#REF!"}},{"$f":"#REF!","v":{"$error":"#REF!"}},{"$f":"#REF!","v":{"$error":"#REF!"}},{"$f":"#REF!","v":{"$error":"#REF!"}},{"$f":"#REF!","v":{"$error":"#REF!"}},{"$f":"#REF!","v":{"$error":"#REF!"}},{"$f":"#REF!","v":{"$error":"#REF!"}},{"$f":"#REF!","v":{"$error":"#REF!"}},{"$f":"#REF!","v":{"$error":"#REF!"}},{"$f":"#REF!","v":{"$error":"#REF!"}},{"$f":"#REF!","v":{"$error":"#REF!"}},{"$f":"#REF!","v":{"$error":"#REF!"}}]
[200,{"$f":"#REF!","v":{"$error":"#REF!"}},{"$f":"#REF!","v":{"$error":"#REF!"}},{"$f":"#REF!","v":{"$error":"#REF!"}},{"$f":"#REF!","v":{"$error":"#REF!"}},{"$f":"#REF!","v":{"$error":"#REF!"}},{"$f":"#REF!","v":{"$error":"#REF!"}},{"$f":"#REF!","v":{"$error":"#REF!"}},{"$f":"#REF!","v":{"$error":"#REF!"}},{"$f":"#REF!","v":{"$error":"#REF!"}},{"$f":"#REF!","v":{"$error":"#REF!"}},{"$f":"#REF!","v":{"$error":"#REF!"}},{"$f":"#REF!","v":{"$error":"#REF!"}},{"$f":"#REF!","v":{"$error":"#REF!"}},{"$f":"#REF!","v":{"$error":"#REF!"}},{"$f":"#REF!","v":{"$error":"#REF!"}},{"$f":"#REF!","v":{"$error":"#REF!"}},{"$f":"#REF!","v":{"$error":"#REF!"}},{"$f":"#REF!","v":{"$error":"#REF!"}},{"$f":"#REF!","v":{"$error":"#REF!"}},{"$f":"#REF!","v":{"$error":"#REF!"}},{"$f":"#REF!","v":{"$error":"#REF!"}},{"$f":"#REF!","v":{"$error":"#REF!"}}]
[210,{"$f":"#REF!","v":{"$error":"#REF!"}},{"$f":"#REF!","v":{"$error":"#REF!"}},{"$f":"#REF!","v":{"$error":"#REF!"}},{"$f":"#REF!","v":{"$error":"#REF!"}},{"$f":"#REF!","v":{"$error":"#REF!"}},{"$f":"#REF!","v":{"$error":"#REF!"}},{"$f":"#REF!","v":{"$error":"#REF!"}},{"$f":"#REF!","v":{"$error":"#REF!"}},{"$f":"#REF!","v":{"$error":"#REF!"}},{"$f":"#REF!","v":{"$error":"#REF!"}},{"$f":"#REF!","v":{"$error":"#REF!"}},{"$f":"#REF!","v":{"$error":"#REF!"}},{"$f":"#REF!","v":{"$error":"#REF!"}},{"$f":"#REF!","v":{"$error":"#REF!"}},{"$f":"#REF!","v":{"$error":"#REF!"}},{"$f":"#REF!","v":{"$error":"#REF!"}},{"$f":"#REF!","v":{"$error":"#REF!"}},{"$f":"#REF!","v":{"$error":"#REF!"}},{"$f":"#REF!","v":{"$error":"#REF!"}},{"$f":"#REF!","v":{"$error":"#REF!"}},{"$f":"#REF!","v":{"$error":"#REF!"}},{"$f":"#REF!","v":{"$error":"#REF!"}}]
[220,{"$f":"#REF!","v":{"$error":"#REF!"}},{"$f":"#REF!","v":{"$error":"#REF!"}},{"$f":"#REF!","v":{"$error":"#REF!"}},{"$f":"#REF!","v":{"$error":"#REF!"}},{"$f":"#REF!","v":{"$error":"#REF!"}},{"$f":"#REF!","v":{"$error":"#REF!"}},{"$f":"#REF!","v":{"$error":"#REF!"}},{"$f":"#REF!","v":{"$error":"#REF!"}},{"$f":"#REF!","v":{"$error":"#REF!"}},{"$f":"#REF!","v":{"$error":"#REF!"}},{"$f":"#REF!","v":{"$error":"#REF!"}},{"$f":"#REF!","v":{"$error":"#REF!"}},{"$f":"#REF!","v":{"$error":"#REF!"}},{"$f":"#REF!","v":{"$error":"#REF!"}},{"$f":"#REF!","v":{"$error":"#REF!"}},{"$f":"#REF!","v":{"$error":"#REF!"}},{"$f":"#REF!","v":{"$error":"#REF!"}},{"$f":"#REF!","v":{"$error":"#REF!"}},{"$f":"#REF!","v":{"$error":"#REF!"}},{"$f":"#REF!","v":{"$error":"#REF!"}},{"$f":"#REF!","v":{"$error":"#REF!"}},{"$f":"#REF!","v":{"$error":"#REF!"}}]
[230,{"$f":"#REF!","v":{"$error":"#REF!"}},{"$f":"#REF!","v":{"$error":"#REF!"}},{"$f":"#REF!","v":{"$error":"#REF!"}},{"$f":"#REF!","v":{"$error":"#REF!"}},{"$f":"#REF!","v":{"$error":"#REF!"}},{"$f":"#REF!","v":{"$error":"#REF!"}},{"$f":"#REF!","v":{"$error":"#REF!"}},{"$f":"#REF!","v":{"$error":"#REF!"}},{"$f":"#REF!","v":{"$error":"#REF!"}},{"$f":"#REF!","v":{"$error":"#REF!"}},{"$f":"#REF!","v":{"$error":"#REF!"}},{"$f":"#REF!","v":{"$error":"#REF!"}},{"$f":"#REF!","v":{"$error":"#REF!"}},{"$f":"#REF!","v":{"$error":"#REF!"}},{"$f":"#REF!","v":{"$error":"#REF!"}},{"$f":"#REF!","v":{"$error":"#REF!"}},{"$f":"#REF!","v":{"$error":"#REF!"}},{"$f":"#REF!","v":{"$error":"#REF!"}},{"$f":"#REF!","v":{"$error":"#REF!"}},{"$f":"#REF!","v":{"$error":"#REF!"}},{"$f":"#REF!","v":{"$error":"#REF!"}},{"$f":"#REF!","v":{"$error":"#REF!"}}]
[240,{"$f":"#REF!","v":{"$error":"#REF!"}},{"$f":"#REF!","v":{"$error":"#REF!"}},{"$f":"#REF!","v":{"$error":"#REF!"}},{"$f":"#REF!","v":{"$error":"#REF!"}},{"$f":"#REF!","v":{"$error":"#REF!"}},{"$f":"#REF!","v":{"$error":"#REF!"}},{"$f":"#REF!","v":{"$error":"#REF!"}},{"$f":"#REF!","v":{"$error":"#REF!"}},{"$f":"#REF!","v":{"$error":"#REF!"}},{"$f":"#REF!","v":{"$error":"#REF!"}},{"$f":"#REF!","v":{"$error":"#REF!"}},{"$f":"#REF!","v":{"$error":"#REF!"}},{"$f":"#REF!","v":{"$error":"#REF!"}},{"$f":"#REF!","v":{"$error":"#REF!"}},{"$f":"#REF!","v":{"$error":"#REF!"}},{"$f":"#REF!","v":{"$error":"#REF!"}},{"$f":"#REF!","v":{"$error":"#REF!"}},{"$f":"#REF!","v":{"$error":"#REF!"}},{"$f":"#REF!","v":{"$error":"#REF!"}},{"$f":"#REF!","v":{"$error":"#REF!"}},{"$f":"#REF!","v":{"$error":"#REF!"}},{"$f":"#REF!","v":{"$error":"#REF!"}}]
[250,{"$f":"#REF!","v":{"$error":"#REF!"}},{"$f":"#REF!","v":{"$error":"#REF!"}},{"$f":"#REF!","v":{"$error":"#REF!"}},{"$f":"#REF!","v":{"$error":"#REF!"}},{"$f":"#REF!","v":{"$error":"#REF!"}},{"$f":"#REF!","v":{"$error":"#REF!"}},{"$f":"#REF!","v":{"$error":"#REF!"}},{"$f":"#REF!","v":{"$error":"#REF!"}},{"$f":"#REF!","v":{"$error":"#REF!"}},{"$f":"#REF!","v":{"$error":"#REF!"}},{"$f":"#REF!","v":{"$error":"#REF!"}},{"$f":"#REF!","v":{"$error":"#REF!"}},{"$f":"#REF!","v":{"$error":"#REF!"}},{"$f":"#REF!","v":{"$error":"#REF!"}},{"$f":"#REF!","v":{"$error":"#REF!"}},{"$f":"#REF!","v":{"$error":"#REF!"}},{"$f":"#REF!","v":{"$error":"#REF!"}},{"$f":"#REF!","v":{"$error":"#REF!"}},{"$f":"#REF!","v":{"$error":"#REF!"}},{"$f":"#REF!","v":{"$error":"#REF!"}},{"$f":"#REF!","v":{"$error":"#REF!"}},{"$f":"#REF!","v":{"$error":"#REF!"}}]
[260,{"$f":"#REF!","v":{"$error":"#REF!"}},{"$f":"#REF!","v":{"$error":"#REF!"}},{"$f":"#REF!","v":{"$error":"#REF!"}},{"$f":"#REF!","v":{"$error":"#REF!"}},{"$f":"#REF!","v":{"$error":"#REF!"}},{"$f":"#REF!","v":{"$error":"#REF!"}},{"$f":"#REF!","v":{"$error":"#REF!"}},{"$f":"#REF!","v":{"$error":"#REF!"}},{"$f":"#REF!","v":{"$error":"#REF!"}},{"$f":"#REF!","v":{"$error":"#REF!"}},{"$f":"#REF!","v":{"$error":"#REF!"}},{"$f":"#REF!","v":{"$error":"#REF!"}},{"$f":"#REF!","v":{"$error":"#REF!"}},{"$f":"#REF!","v":{"$error":"#REF!"}},{"$f":"#REF!","v":{"$error":"#REF!"}},{"$f":"#REF!","v":{"$error":"#REF!"}},{"$f":"#REF!","v":{"$error":"#REF!"}},{"$f":"#REF!","v":{"$error":"#REF!"}},{"$f":"#REF!","v":{"$error":"#REF!"}},{"$f":"#REF!","v":{"$error":"#REF!"}},{"$f":"#REF!","v":{"$error":"#REF!"}},{"$f":"#REF!","v":{"$error":"#REF!"}}]
[270,{"$f":"#REF!","v":{"$error":"#REF!"}},{"$f":"#REF!","v":{"$error":"#REF!"}},{"$f":"#REF!","v":{"$error":"#REF!"}},{"$f":"#REF!","v":{"$error":"#REF!"}},{"$f":"#REF!","v":{"$error":"#REF!"}},{"$f":"#REF!","v":{"$error":"#REF!"}},{"$f":"#REF!","v":{"$error":"#REF!"}},{"$f":"#REF!","v":{"$error":"#REF!"}},{"$f":"#REF!","v":{"$error":"#REF!"}},{"$f":"#REF!","v":{"$error":"#REF!"}},{"$f":"#REF!","v":{"$error":"#REF!"}},{"$f":"#REF!","v":{"$error":"#REF!"}},{"$f":"#REF!","v":{"$error":"#REF!"}},{"$f":"#REF!","v":{"$error":"#REF!"}},{"$f":"#REF!","v":{"$error":"#REF!"}},{"$f":"#REF!","v":{"$error":"#REF!"}},{"$f":"#REF!","v":{"$error":"#REF!"}},{"$f":"#REF!","v":{"$error":"#REF!"}},{"$f":"#REF!","v":{"$error":"#REF!"}},{"$f":"#REF!","v":{"$error":"#REF!"}},{"$f":"#REF!","v":{"$error":"#REF!"}},{"$f":"#REF!","v":{"$error":"#REF!"}}]
[280,{"$f":"#REF!","v":{"$error":"#REF!"}},{"$f":"#REF!","v":{"$error":"#REF!"}},{"$f":"#REF!","v":{"$error":"#REF!"}},{"$f":"#REF!","v":{"$error":"#REF!"}},{"$f":"#REF!","v":{"$error":"#REF!"}},{"$f":"#REF!","v":{"$error":"#REF!"}},{"$f":"#REF!","v":{"$error":"#REF!"}},{"$f":"#REF!","v":{"$error":"#REF!"}},{"$f":"#REF!","v":{"$error":"#REF!"}},{"$f":"#REF!","v":{"$error":"#REF!"}},{"$f":"#REF!","v":{"$error":"#REF!"}},{"$f":"#REF!","v":{"$error":"#REF!"}},{"$f":"#REF!","v":{"$error":"#REF!"}},{"$f":"#REF!","v":{"$error":"#REF!"}},{"$f":"#REF!","v":{"$error":"#REF!"}},{"$f":"#REF!","v":{"$error":"#REF!"}},{"$f":"#REF!","v":{"$error":"#REF!"}},{"$f":"#REF!","v":{"$error":"#REF!"}},{"$f":"#REF!","v":{"$error":"#REF!"}},{"$f":"#REF!","v":{"$error":"#REF!"}},{"$f":"#REF!","v":{"$error":"#REF!"}},{"$f":"#REF!","v":{"$error":"#REF!"}}]
[290,{"$f":"#REF!","v":{"$error":"#REF!"}},{"$f":"#REF!","v":{"$error":"#REF!"}},{"$f":"#REF!","v":{"$error":"#REF!"}},{"$f":"#REF!","v":{"$error":"#REF!"}},{"$f":"#REF!","v":{"$error":"#REF!"}},{"$f":"#REF!","v":{"$error":"#REF!"}},{"$f":"#REF!","v":{"$error":"#REF!"}},{"$f":"#REF!","v":{"$error":"#REF!"}},{"$f":"#REF!","v":{"$error":"#REF!"}},{"$f":"#REF!","v":{"$error":"#REF!"}},{"$f":"#REF!","v":{"$error":"#REF!"}},{"$f":"#REF!","v":{"$error":"#REF!"}},{"$f":"#REF!","v":{"$error":"#REF!"}},{"$f":"#REF!","v":{"$error":"#REF!"}},{"$f":"#REF!","v":{"$error":"#REF!"}},{"$f":"#REF!","v":{"$error":"#REF!"}},{"$f":"#REF!","v":{"$error":"#REF!"}},{"$f":"#REF!","v":{"$error":"#REF!"}},{"$f":"#REF!","v":{"$error":"#REF!"}},{"$f":"#REF!","v":{"$error":"#REF!"}},{"$f":"#REF!","v":{"$error":"#REF!"}},{"$f":"#REF!","v":{"$error":"#REF!"}}]
[300,{"$f":"#REF!","v":{"$error":"#REF!"}},{"$f":"#REF!","v":{"$error":"#REF!"}},{"$f":"#REF!","v":{"$error":"#REF!"}},{"$f":"#REF!","v":{"$error":"#REF!"}},{"$f":"#REF!","v":{"$error":"#REF!"}},{"$f":"#REF!","v":{"$error":"#REF!"}},{"$f":"#REF!","v":{"$error":"#REF!"}},{"$f":"#REF!","v":{"$error":"#REF!"}},{"$f":"#REF!","v":{"$error":"#REF!"}},{"$f":"#REF!","v":{"$error":"#REF!"}},{"$f":"#REF!","v":{"$error":"#REF!"}},{"$f":"#REF!","v":{"$error":"#REF!"}},{"$f":"#REF!","v":{"$error":"#REF!"}},{"$f":"#REF!","v":{"$error":"#REF!"}},{"$f":"#REF!","v":{"$error":"#REF!"}},{"$f":"#REF!","v":{"$error":"#REF!"}},{"$f":"#REF!","v":{"$error":"#REF!"}},{"$f":"#REF!","v":{"$error":"#REF!"}},{"$f":"#REF!","v":{"$error":"#REF!"}},{"$f":"#REF!","v":{"$error":"#REF!"}},{"$f":"#REF!","v":{"$error":"#REF!"}},{"$f":"#REF!","v":{"$error":"#REF!"}}]
[310,{"$f":"#REF!","v":{"$error":"#REF!"}},{"$f":"#REF!","v":{"$error":"#REF!"}},{"$f":"#REF!","v":{"$error":"#REF!"}},{"$f":"#REF!","v":{"$error":"#REF!"}},{"$f":"#REF!","v":{"$error":"#REF!"}},{"$f":"#REF!","v":{"$error":"#REF!"}},{"$f":"#REF!","v":{"$error":"#REF!"}},{"$f":"#REF!","v":{"$error":"#REF!"}},{"$f":"#REF!","v":{"$error":"#REF!"}},{"$f":"#REF!","v":{"$error":"#REF!"}},{"$f":"#REF!","v":{"$error":"#REF!"}},{"$f":"#REF!","v":{"$error":"#REF!"}},{"$f":"#REF!","v":{"$error":"#REF!"}},{"$f":"#REF!","v":{"$error":"#REF!"}},{"$f":"#REF!","v":{"$error":"#REF!"}},{"$f":"#REF!","v":{"$error":"#REF!"}},{"$f":"#REF!","v":{"$error":"#REF!"}},{"$f":"#REF!","v":{"$error":"#REF!"}},{"$f":"#REF!","v":{"$error":"#REF!"}},{"$f":"#REF!","v":{"$error":"#REF!"}},{"$f":"#REF!","v":{"$error":"#REF!"}},{"$f":"#REF!","v":{"$error":"#REF!"}}]
[320,{"$f":"#REF!","v":{"$error":"#REF!"}},{"$f":"#REF!","v":{"$error":"#REF!"}},{"$f":"#REF!","v":{"$error":"#REF!"}},{"$f":"#REF!","v":{"$error":"#REF!"}},{"$f":"#REF!","v":{"$error":"#REF!"}},{"$f":"#REF!","v":{"$error":"#REF!"}},{"$f":"#REF!","v":{"$error":"#REF!"}},{"$f":"#REF!","v":{"$error":"#REF!"}},{"$f":"#REF!","v":{"$error":"#REF!"}},{"$f":"#REF!","v":{"$error":"#REF!"}},{"$f":"#REF!","v":{"$error":"#REF!"}},{"$f":"#REF!","v":{"$error":"#REF!"}},{"$f":"#REF!","v":{"$error":"#REF!"}},{"$f":"#REF!","v":{"$error":"#REF!"}},{"$f":"#REF!","v":{"$error":"#REF!"}},{"$f":"#REF!","v":{"$error":"#REF!"}},{"$f":"#REF!","v":{"$error":"#REF!"}},{"$f":"#REF!","v":{"$error":"#REF!"}},{"$f":"#REF!","v":{"$error":"#REF!"}},{"$f":"#REF!","v":{"$error":"#REF!"}},{"$f":"#REF!","v":{"$error":"#REF!"}},{"$f":"#REF!","v":{"$error":"#REF!"}}]
[330,{"$f":"#REF!","v":{"$error":"#REF!"}},{"$f":"#REF!","v":{"$error":"#REF!"}},{"$f":"#REF!","v":{"$error":"#REF!"}},{"$f":"#REF!","v":{"$error":"#REF!"}},{"$f":"#REF!","v":{"$error":"#REF!"}},{"$f":"#REF!","v":{"$error":"#REF!"}},{"$f":"#REF!","v":{"$error":"#REF!"}},{"$f":"#REF!","v":{"$error":"#REF!"}},{"$f":"#REF!","v":{"$error":"#REF!"}},{"$f":"#REF!","v":{"$error":"#REF!"}},{"$f":"#REF!","v":{"$error":"#REF!"}},{"$f":"#REF!","v":{"$error":"#REF!"}},{"$f":"#REF!","v":{"$error":"#REF!"}},{"$f":"#REF!","v":{"$error":"#REF!"}},{"$f":"#REF!","v":{"$error":"#REF!"}},{"$f":"#REF!","v":{"$error":"#REF!"}},{"$f":"#REF!","v":{"$error":"#REF!"}},{"$f":"#REF!","v":{"$error":"#REF!"}},{"$f":"#REF!","v":{"$error":"#REF!"}},{"$f":"#REF!","v":{"$error":"#REF!"}},{"$f":"#REF!","v":{"$error":"#REF!"}},{"$f":"#REF!","v":{"$error":"#REF!"}}]
[340,{"$f":"#REF!","v":{"$error":"#REF!"}},{"$f":"#REF!","v":{"$error":"#REF!"}},{"$f":"#REF!","v":{"$error":"#REF!"}},{"$f":"#REF!","v":{"$error":"#REF!"}},{"$f":"#REF!","v":{"$error":"#REF!"}},{"$f":"#REF!","v":{"$error":"#REF!"}},{"$f":"#REF!","v":{"$error":"#REF!"}},{"$f":"#REF!","v":{"$error":"#REF!"}},{"$f":"#REF!","v":{"$error":"#REF!"}},{"$f":"#REF!","v":{"$error":"#REF!"}},{"$f":"#REF!","v":{"$error":"#REF!"}},{"$f":"#REF!","v":{"$error":"#REF!"}},{"$f":"#REF!","v":{"$error":"#REF!"}},{"$f":"#REF!","v":{"$error":"#REF!"}},{"$f":"#REF!","v":{"$error":"#REF!"}},{"$f":"#REF!","v":{"$error":"#REF!"}},{"$f":"#REF!","v":{"$error":"#REF!"}},{"$f":"#REF!","v":{"$error":"#REF!"}},{"$f":"#REF!","v":{"$error":"#REF!"}},{"$f":"#REF!","v":{"$error":"#REF!"}},{"$f":"#REF!","v":{"$error":"#REF!"}},{"$f":"#REF!","v":{"$error":"#REF!"}}]
[350,{"$f":"#REF!","v":{"$error":"#REF!"}},{"$f":"#REF!","v":{"$error":"#REF!"}},{"$f":"#REF!","v":{"$error":"#REF!"}},{"$f":"#REF!","v":{"$error":"#REF!"}},{"$f":"#REF!","v":{"$error":"#REF!"}},{"$f":"#REF!","v":{"$error":"#REF!"}},{"$f":"#REF!","v":{"$error":"#REF!"}},{"$f":"#REF!","v":{"$error":"#REF!"}},{"$f":"#REF!","v":{"$error":"#REF!"}},{"$f":"#REF!","v":{"$error":"#REF!"}},{"$f":"#REF!","v":{"$error":"#REF!"}},{"$f":"#REF!","v":{"$error":"#REF!"}},{"$f":"#REF!","v":{"$error":"#REF!"}},{"$f":"#REF!","v":{"$error":"#REF!"}},{"$f":"#REF!","v":{"$error":"#REF!"}},{"$f":"#REF!","v":{"$error":"#REF!"}},{"$f":"#REF!","v":{"$error":"#REF!"}},{"$f":"#REF!","v":{"$error":"#REF!"}},{"$f":"#REF!","v":{"$error":"#REF!"}},{"$f":"#REF!","v":{"$error":"#REF!"}},{"$f":"#REF!","v":{"$error":"#REF!"}},{"$f":"#REF!","v":{"$error":"#REF!"}}]
[360,{"$f":"#REF!","v":{"$error":"#REF!"}},{"$f":"#REF!","v":{"$error":"#REF!"}},{"$f":"#REF!","v":{"$error":"#REF!"}},{"$f":"#REF!","v":{"$error":"#REF!"}},{"$f":"#REF!","v":{"$error":"#REF!"}},{"$f":"#REF!","v":{"$error":"#REF!"}},{"$f":"#REF!","v":{"$error":"#REF!"}},{"$f":"#REF!","v":{"$error":"#REF!"}},{"$f":"#REF!","v":{"$error":"#REF!"}},{"$f":"#REF!","v":{"$error":"#REF!"}},{"$f":"#REF!","v":{"$error":"#REF!"}},{"$f":"#REF!","v":{"$error":"#REF!"}},{"$f":"#REF!","v":{"$error":"#REF!"}},{"$f":"#REF!","v":{"$error":"#REF!"}},{"$f":"#REF!","v":{"$error":"#REF!"}},{"$f":"#REF!","v":{"$error":"#REF!"}},{"$f":"#REF!","v":{"$error":"#REF!"}},{"$f":"#REF!","v":{"$error":"#REF!"}},{"$f":"#REF!","v":{"$error":"#REF!"}},{"$f":"#REF!","v":{"$error":"#REF!"}},{"$f":"#REF!","v":{"$error":"#REF!"}},{"$f":"#REF!","v":{"$error":"#REF!"}}]
[370,{"$f":"#REF!","v":{"$error":"#REF!"}},{"$f":"#REF!","v":{"$error":"#REF!"}},{"$f":"#REF!","v":{"$error":"#REF!"}},{"$f":"#REF!","v":{"$error":"#REF!"}},{"$f":"#REF!","v":{"$error":"#REF!"}},{"$f":"#REF!","v":{"$error":"#REF!"}},{"$f":"#REF!","v":{"$error":"#REF!"}},{"$f":"#REF!","v":{"$error":"#REF!"}},{"$f":"#REF!","v":{"$error":"#REF!"}},{"$f":"#REF!","v":{"$error":"#REF!"}},{"$f":"#REF!","v":{"$error":"#REF!"}},{"$f":"#REF!","v":{"$error":"#REF!"}},{"$f":"#REF!","v":{"$error":"#REF!"}},{"$f":"#REF!","v":{"$error":"#REF!"}},{"$f":"#REF!","v":{"$error":"#REF!"}},{"$f":"#REF!","v":{"$error":"#REF!"}},{"$f":"#REF!","v":{"$error":"#REF!"}},{"$f":"#REF!","v":{"$error":"#REF!"}},{"$f":"#REF!","v":{"$error":"#REF!"}},{"$f":"#REF!","v":{"$error":"#REF!"}},{"$f":"#REF!","v":{"$error":"#REF!"}},{"$f":"#REF!","v":{"$error":"#REF!"}}]
[380,{"$f":"#REF!","v":{"$error":"#REF!"}},{"$f":"#REF!","v":{"$error":"#REF!"}},{"$f":"#REF!","v":{"$error":"#REF!"}},{"$f":"#REF!","v":{"$error":"#REF!"}},{"$f":"#REF!","v":{"$error":"#REF!"}},{"$f":"#REF!","v":{"$error":"#REF!"}},{"$f":"#REF!","v":{"$error":"#REF!"}},{"$f":"#REF!","v":{"$error":"#REF!"}},{"$f":"#REF!","v":{"$error":"#REF!"}},{"$f":"#REF!","v":{"$error":"#REF!"}},{"$f":"#REF!","v":{"$error":"#REF!"}},{"$f":"#REF!","v":{"$error":"#REF!"}},{"$f":"#REF!","v":{"$error":"#REF!"}},{"$f":"#REF!","v":{"$error":"#REF!"}},{"$f":"#REF!","v":{"$error":"#REF!"}},{"$f":"#REF!","v":{"$error":"#REF!"}},{"$f":"#REF!","v":{"$error":"#REF!"}},{"$f":"#REF!","v":{"$error":"#REF!"}},{"$f":"#REF!","v":{"$error":"#REF!"}},{"$f":"#REF!","v":{"$error":"#REF!"}},{"$f":"#REF!","v":{"$error":"#REF!"}},{"$f":"#REF!","v":{"$error":"#REF!"}}]
[390,{"$f":"#REF!","v":{"$error":"#REF!"}},{"$f":"#REF!","v":{"$error":"#REF!"}},{"$f":"#REF!","v":{"$error":"#REF!"}},{"$f":"#REF!","v":{"$error":"#REF!"}},{"$f":"#REF!","v":{"$error":"#REF!"}},{"$f":"#REF!","v":{"$error":"#REF!"}},{"$f":"#REF!","v":{"$error":"#REF!"}},{"$f":"#REF!","v":{"$error":"#REF!"}},{"$f":"#REF!","v":{"$error":"#REF!"}},{"$f":"#REF!","v":{"$error":"#REF!"}},{"$f":"#REF!","v":{"$error":"#REF!"}},{"$f":"#REF!","v":{"$error":"#REF!"}},{"$f":"#REF!","v":{"$error":"#REF!"}},{"$f":"#REF!","v":{"$error":"#REF!"}},{"$f":"#REF!","v":{"$error":"#REF!"}},{"$f":"#REF!","v":{"$error":"#REF!"}},{"$f":"#REF!","v":{"$error":"#REF!"}},{"$f":"#REF!","v":{"$error":"#REF!"}},{"$f":"#REF!","v":{"$error":"#REF!"}},{"$f":"#REF!","v":{"$error":"#REF!"}},{"$f":"#REF!","v":{"$error":"#REF!"}},{"$f":"#REF!","v":{"$error":"#REF!"}}]
[400,{"$f":"#REF!","v":{"$error":"#REF!"}},{"$f":"#REF!","v":{"$error":"#REF!"}},{"$f":"#REF!","v":{"$error":"#REF!"}},{"$f":"#REF!","v":{"$error":"#REF!"}},{"$f":"#REF!","v":{"$error":"#REF!"}},{"$f":"#REF!","v":{"$error":"#REF!"}},{"$f":"#REF!","v":{"$error":"#REF!"}},{"$f":"#REF!","v":{"$error":"#REF!"}},{"$f":"#REF!","v":{"$error":"#REF!"}},{"$f":"#REF!","v":{"$error":"#REF!"}},{"$f":"#REF!","v":{"$error":"#REF!"}},{"$f":"#REF!","v":{"$error":"#REF!"}},{"$f":"#REF!","v":{"$error":"#REF!"}},{"$f":"#REF!","v":{"$error":"#REF!"}},{"$f":"#REF!","v":{"$error":"#REF!"}},{"$f":"#REF!","v":{"$error":"#REF!"}},{"$f":"#REF!","v":{"$error":"#REF!"}},{"$f":"#REF!","v":{"$error":"#REF!"}},{"$f":"#REF!","v":{"$error":"#REF!"}},{"$f":"#REF!","v":{"$error":"#REF!"}},{"$f":"#REF!","v":{"$error":"#REF!"}},{"$f":"#REF!","v":{"$error":"#REF!"}}]

{"sheet":"RIBS4","index":6,"n_rows":38,"n_cols":23,"rows_kept":38,"hidden":true}
[null,40,50,60,70,80,90,100,110,120,130,140,150,160,170,180,190,200,210,220,230,240,250]
[40,{"$f":"#REF!","v":{"$error":"#REF!"}},{"$f":"#REF!","v":{"$error":"#REF!"}},{"$f":"#REF!","v":{"$error":"#REF!"}},{"$f":"#REF!","v":{"$error":"#REF!"}},{"$f":"#REF!","v":{"$error":"#REF!"}},{"$f":"#REF!","v":{"$error":"#REF!"}},{"$f":"#REF!","v":{"$error":"#REF!"}},{"$f":"#REF!","v":{"$error":"#REF!"}},{"$f":"#REF!","v":{"$error":"#REF!"}},{"$f":"#REF!","v":{"$error":"#REF!"}},{"$f":"#REF!","v":{"$error":"#REF!"}},{"$f":"#REF!","v":{"$error":"#REF!"}},{"$f":"#REF!","v":{"$error":"#REF!"}},{"$f":"#REF!","v":{"$error":"#REF!"}},{"$f":"#REF!","v":{"$error":"#REF!"}},{"$f":"#REF!","v":{"$error":"#REF!"}},{"$f":"#REF!","v":{"$error":"#REF!"}},{"$f":"#REF!","v":{"$error":"#REF!"}},{"$f":"#REF!","v":{"$error":"#REF!"}},{"$f":"#REF!","v":{"$error":"#REF!"}},{"$f":"#REF!","v":{"$error":"#REF!"}},{"$f":"#REF!","v":{"$error":"#REF!"}}]
[50,{"$f":"#REF!","v":{"$error":"#REF!"}},{"$f":"#REF!","v":{"$error":"#REF!"}},{"$f":"#REF!","v":{"$error":"#REF!"}},{"$f":"#REF!","v":{"$error":"#REF!"}},{"$f":"#REF!","v":{"$error":"#REF!"}},{"$f":"#REF!","v":{"$error":"#REF!"}},{"$f":"#REF!","v":{"$error":"#REF!"}},{"$f":"#REF!","v":{"$error":"#REF!"}},{"$f":"#REF!","v":{"$error":"#REF!"}},{"$f":"#REF!","v":{"$error":"#REF!"}},{"$f":"#REF!","v":{"$error":"#REF!"}},{"$f":"#REF!","v":{"$error":"#REF!"}},{"$f":"#REF!","v":{"$error":"#REF!"}},{"$f":"#REF!","v":{"$error":"#REF!"}},{"$f":"#REF!","v":{"$error":"#REF!"}},{"$f":"#REF!","v":{"$error":"#REF!"}},{"$f":"#REF!","v":{"$error":"#REF!"}},{"$f":"#REF!","v":{"$error":"#REF!"}},{"$f":"#REF!","v":{"$error":"#REF!"}},{"$f":"#REF!","v":{"$error":"#REF!"}},{"$f":"#REF!","v":{"$error":"#REF!"}},{"$f":"#REF!","v":{"$error":"#REF!"}}]
[60,{"$f":"#REF!","v":{"$error":"#REF!"}},{"$f":"#REF!","v":{"$error":"#REF!"}},{"$f":"#REF!","v":{"$error":"#REF!"}},{"$f":"#REF!","v":{"$error":"#REF!"}},{"$f":"#REF!","v":{"$error":"#REF!"}},{"$f":"#REF!","v":{"$error":"#REF!"}},{"$f":"#REF!","v":{"$error":"#REF!"}},{"$f":"#REF!","v":{"$error":"#REF!"}},{"$f":"#REF!","v":{"$error":"#REF!"}},{"$f":"#REF!","v":{"$error":"#REF!"}},{"$f":"#REF!","v":{"$error":"#REF!"}},{"$f":"#REF!","v":{"$error":"#REF!"}},{"$f":"#REF!","v":{"$error":"#REF!"}},{"$f":"#REF!","v":{"$error":"#REF!"}},{"$f":"#REF!","v":{"$error":"#REF!"}},{"$f":"#REF!","v":{"$error":"#REF!"}},{"$f":"#REF!","v":{"$error":"#REF!"}},{"$f":"#REF!","v":{"$error":"#REF!"}},{"$f":"#REF!","v":{"$error":"#REF!"}},{"$f":"#REF!","v":{"$error":"#REF!"}},{"$f":"#REF!","v":{"$error":"#REF!"}},{"$f":"#REF!","v":{"$error":"#REF!"}}]
[70,{"$f":"#REF!","v":{"$error":"#REF!"}},{"$f":"#REF!","v":{"$error":"#REF!"}},{"$f":"#REF!","v":{"$error":"#REF!"}},{"$f":"#REF!","v":{"$error":"#REF!"}},{"$f":"#REF!","v":{"$error":"#REF!"}},{"$f":"#REF!","v":{"$error":"#REF!"}},{"$f":"#REF!","v":{"$error":"#REF!"}},{"$f":"#REF!","v":{"$error":"#REF!"}},{"$f":"#REF!","v":{"$error":"#REF!"}},{"$f":"#REF!","v":{"$error":"#REF!"}},{"$f":"#REF!","v":{"$error":"#REF!"}},{"$f":"#REF!","v":{"$error":"#REF!"}},{"$f":"#REF!","v":{"$error":"#REF!"}},{"$f":"#REF!","v":{"$error":"#REF!"}},{"$f":"#REF!","v":{"$error":"#REF!"}},{"$f":"#REF!","v":{"$error":"#REF!"}},{"$f":"#REF!","v":{"$error":"#REF!"}},{"$f":"#REF!","v":{"$error":"#REF!"}},{"$f":"#REF!","v":{"$error":"#REF!"}},{"$f":"#REF!","v":{"$error":"#REF!"}},{"$f":"#REF!","v":{"$error":"#REF!"}},{"$f":"#REF!","v":{"$error":"#REF!"}}]
[80,{"$f":"#REF!","v":{"$error":"#REF!"}},{"$f":"#REF!","v":{"$error":"#REF!"}},{"$f":"#REF!","v":{"$error":"#REF!"}},{"$f":"#REF!","v":{"$error":"#REF!"}},{"$f":"#REF!","v":{"$error":"#REF!"}},{"$f":"#REF!","v":{"$error":"#REF!"}},{"$f":"#REF!","v":{"$error":"#REF!"}},{"$f":"#REF!","v":{"$error":"#REF!"}},{"$f":"#REF!","v":{"$error":"#REF!"}},{"$f":"#REF!","v":{"$error":"#REF!"}},{"$f":"#REF!","v":{"$error":"#REF!"}},{"$f":"#REF!","v":{"$error":"#REF!"}},{"$f":"#REF!","v":{"$error":"#REF!"}},{"$f":"#REF!","v":{"$error":"#REF!"}},{"$f":"#REF!","v":{"$error":"#REF!"}},{"$f":"#REF!","v":{"$error":"#REF!"}},{"$f":"#REF!","v":{"$error":"#REF!"}},{"$f":"#REF!","v":{"$error":"#REF!"}},{"$f":"#REF!","v":{"$error":"#REF!"}},{"$f":"#REF!","v":{"$error":"#REF!"}},{"$f":"#REF!","v":{"$error":"#REF!"}},{"$f":"#REF!","v":{"$error":"#REF!"}}]
[90,{"$f":"#REF!","v":{"$error":"#REF!"}},{"$f":"#REF!","v":{"$error":"#REF!"}},{"$f":"#REF!","v":{"$error":"#REF!"}},{"$f":"#REF!","v":{"$error":"#REF!"}},{"$f":"#REF!","v":{"$error":"#REF!"}},{"$f":"#REF!","v":{"$error":"#REF!"}},{"$f":"#REF!","v":{"$error":"#REF!"}},{"$f":"#REF!","v":{"$error":"#REF!"}},{"$f":"#REF!","v":{"$error":"#REF!"}},{"$f":"#REF!","v":{"$error":"#REF!"}},{"$f":"#REF!","v":{"$error":"#REF!"}},{"$f":"#REF!","v":{"$error":"#REF!"}},{"$f":"#REF!","v":{"$error":"#REF!"}},{"$f":"#REF!","v":{"$error":"#REF!"}},{"$f":"#REF!","v":{"$error":"#REF!"}},{"$f":"#REF!","v":{"$error":"#REF!"}},{"$f":"#REF!","v":{"$error":"#REF!"}},{"$f":"#REF!","v":{"$error":"#REF!"}},{"$f":"#REF!","v":{"$error":"#REF!"}},{"$f":"#REF!","v":{"$error":"#REF!"}},{"$f":"#REF!","v":{"$error":"#REF!"}},{"$f":"#REF!","v":{"$error":"#REF!"}}]
[100,{"$f":"#REF!","v":{"$error":"#REF!"}},{"$f":"#REF!","v":{"$error":"#REF!"}},{"$f":"#REF!","v":{"$error":"#REF!"}},{"$f":"#REF!","v":{"$error":"#REF!"}},{"$f":"#REF!","v":{"$error":"#REF!"}},{"$f":"#REF!","v":{"$error":"#REF!"}},{"$f":"#REF!","v":{"$error":"#REF!"}},{"$f":"#REF!","v":{"$error":"#REF!"}},{"$f":"#REF!","v":{"$error":"#REF!"}},{"$f":"#REF!","v":{"$error":"#REF!"}},{"$f":"#REF!","v":{"$error":"#REF!"}},{"$f":"#REF!","v":{"$error":"#REF!"}},{"$f":"#REF!","v":{"$error":"#REF!"}},{"$f":"#REF!","v":{"$error":"#REF!"}},{"$f":"#REF!","v":{"$error":"#REF!"}},{"$f":"#REF!","v":{"$error":"#REF!"}},{"$f":"#REF!","v":{"$error":"#REF!"}},{"$f":"#REF!","v":{"$error":"#REF!"}},{"$f":"#REF!","v":{"$error":"#REF!"}},{"$f":"#REF!","v":{"$error":"#REF!"}},{"$f":"#REF!","v":{"$error":"#REF!"}},{"$f":"#REF!","v":{"$error":"#REF!"}}]
[110,{"$f":"#REF!","v":{"$error":"#REF!"}},{"$f":"#REF!","v":{"$error":"#REF!"}},{"$f":"#REF!","v":{"$error":"#REF!"}},{"$f":"#REF!","v":{"$error":"#REF!"}},{"$f":"#REF!","v":{"$error":"#REF!"}},{"$f":"#REF!","v":{"$error":"#REF!"}},{"$f":"#REF!","v":{"$error":"#REF!"}},{"$f":"#REF!","v":{"$error":"#REF!"}},{"$f":"#REF!","v":{"$error":"#REF!"}},{"$f":"#REF!","v":{"$error":"#REF!"}},{"$f":"#REF!","v":{"$error":"#REF!"}},{"$f":"#REF!","v":{"$error":"#REF!"}},{"$f":"#REF!","v":{"$error":"#REF!"}},{"$f":"#REF!","v":{"$error":"#REF!"}},{"$f":"#REF!","v":{"$error":"#REF!"}},{"$f":"#REF!","v":{"$error":"#REF!"}},{"$f":"#REF!","v":{"$error":"#REF!"}},{"$f":"#REF!","v":{"$error":"#REF!"}},{"$f":"#REF!","v":{"$error":"#REF!"}},{"$f":"#REF!","v":{"$error":"#REF!"}},{"$f":"#REF!","v":{"$error":"#REF!"}},{"$f":"#REF!","v":{"$error":"#REF!"}}]
[120,{"$f":"#REF!","v":{"$error":"#REF!"}},{"$f":"#REF!","v":{"$error":"#REF!"}},{"$f":"#REF!","v":{"$error":"#REF!"}},{"$f":"#REF!","v":{"$error":"#REF!"}},{"$f":"#REF!","v":{"$error":"#REF!"}},{"$f":"#REF!","v":{"$error":"#REF!"}},{"$f":"#REF!","v":{"$error":"#REF!"}},{"$f":"#REF!","v":{"$error":"#REF!"}},{"$f":"#REF!","v":{"$error":"#REF!"}},{"$f":"#REF!","v":{"$error":"#REF!"}},{"$f":"#REF!","v":{"$error":"#REF!"}},{"$f":"#REF!","v":{"$error":"#REF!"}},{"$f":"#REF!","v":{"$error":"#REF!"}},{"$f":"#REF!","v":{"$error":"#REF!"}},{"$f":"#REF!","v":{"$error":"#REF!"}},{"$f":"#REF!","v":{"$error":"#REF!"}},{"$f":"#REF!","v":{"$error":"#REF!"}},{"$f":"#REF!","v":{"$error":"#REF!"}},{"$f":"#REF!","v":{"$error":"#REF!"}},{"$f":"#REF!","v":{"$error":"#REF!"}},{"$f":"#REF!","v":{"$error":"#REF!"}},{"$f":"#REF!","v":{"$error":"#REF!"}}]
[130,{"$f":"#REF!","v":{"$error":"#REF!"}},{"$f":"#REF!","v":{"$error":"#REF!"}},{"$f":"#REF!","v":{"$error":"#REF!"}},{"$f":"#REF!","v":{"$error":"#REF!"}},{"$f":"#REF!","v":{"$error":"#REF!"}},{"$f":"#REF!","v":{"$error":"#REF!"}},{"$f":"#REF!","v":{"$error":"#REF!"}},{"$f":"#REF!","v":{"$error":"#REF!"}},{"$f":"#REF!","v":{"$error":"#REF!"}},{"$f":"#REF!","v":{"$error":"#REF!"}},{"$f":"#REF!","v":{"$error":"#REF!"}},{"$f":"#REF!","v":{"$error":"#REF!"}},{"$f":"#REF!","v":{"$error":"#REF!"}},{"$f":"#REF!","v":{"$error":"#REF!"}},{"$f":"#REF!","v":{"$error":"#REF!"}},{"$f":"#REF!","v":{"$error":"#REF!"}},{"$f":"#REF!","v":{"$error":"#REF!"}},{"$f":"#REF!","v":{"$error":"#REF!"}},{"$f":"#REF!","v":{"$error":"#REF!"}},{"$f":"#REF!","v":{"$error":"#REF!"}},{"$f":"#REF!","v":{"$error":"#REF!"}},{"$f":"#REF!","v":{"$error":"#REF!"}}]
[140,{"$f":"#REF!","v":{"$error":"#REF!"}},{"$f":"#REF!","v":{"$error":"#REF!"}},{"$f":"#REF!","v":{"$error":"#REF!"}},{"$f":"#REF!","v":{"$error":"#REF!"}},{"$f":"#REF!","v":{"$error":"#REF!"}},{"$f":"#REF!","v":{"$error":"#REF!"}},{"$f":"#REF!","v":{"$error":"#REF!"}},{"$f":"#REF!","v":{"$error":"#REF!"}},{"$f":"#REF!","v":{"$error":"#REF!"}},{"$f":"#REF!","v":{"$error":"#REF!"}},{"$f":"#REF!","v":{"$error":"#REF!"}},{"$f":"#REF!","v":{"$error":"#REF!"}},{"$f":"#REF!","v":{"$error":"#REF!"}},{"$f":"#REF!","v":{"$error":"#REF!"}},{"$f":"#REF!","v":{"$error":"#REF!"}},{"$f":"#REF!","v":{"$error":"#REF!"}},{"$f":"#REF!","v":{"$error":"#REF!"}},{"$f":"#REF!","v":{"$error":"#REF!"}},{"$f":"#REF!","v":{"$error":"#REF!"}},{"$f":"#REF!","v":{"$error":"#REF!"}},{"$f":"#REF!","v":{"$error":"#REF!"}},{"$f":"#REF!","v":{"$error":"#REF!"}}]
[150,{"$f":"#REF!","v":{"$error":"#REF!"}},{"$f":"#REF!","v":{"$error":"#REF!"}},{"$f":"#REF!","v":{"$error":"#REF!"}},{"$f":"#REF!","v":{"$error":"#REF!"}},{"$f":"#REF!","v":{"$error":"#REF!"}},{"$f":"#REF!","v":{"$error":"#REF!"}},{"$f":"#REF!","v":{"$error":"#REF!"}},{"$f":"#REF!","v":{"$error":"#REF!"}},{"$f":"#REF!","v":{"$error":"#REF!"}},{"$f":"#REF!","v":{"$error":"#REF!"}},{"$f":"#REF!","v":{"$error":"#REF!"}},{"$f":"#REF!","v":{"$error":"#REF!"}},{"$f":"#REF!","v":{"$error":"#REF!"}},{"$f":"#REF!","v":{"$error":"#REF!"}},{"$f":"#REF!","v":{"$error":"#REF!"}},{"$f":"#REF!","v":{"$error":"#REF!"}},{"$f":"#REF!","v":{"$error":"#REF!"}},{"$f":"#REF!","v":{"$error":"#REF!"}},{"$f":"#REF!","v":{"$error":"#REF!"}},{"$f":"#REF!","v":{"$error":"#REF!"}},{"$f":"#REF!","v":{"$error":"#REF!"}},{"$f":"#REF!","v":{"$error":"#REF!"}}]
[160,{"$f":"#REF!","v":{"$error":"#REF!"}},{"$f":"#REF!","v":{"$error":"#REF!"}},{"$f":"#REF!","v":{"$error":"#REF!"}},{"$f":"#REF!","v":{"$error":"#REF!"}},{"$f":"#REF!","v":{"$error":"#REF!"}},{"$f":"#REF!","v":{"$error":"#REF!"}},{"$f":"#REF!","v":{"$error":"#REF!"}},{"$f":"#REF!","v":{"$error":"#REF!"}},{"$f":"#REF!","v":{"$error":"#REF!"}},{"$f":"#REF!","v":{"$error":"#REF!"}},{"$f":"#REF!","v":{"$error":"#REF!"}},{"$f":"#REF!","v":{"$error":"#REF!"}},{"$f":"#REF!","v":{"$error":"#REF!"}},{"$f":"#REF!","v":{"$error":"#REF!"}},{"$f":"#REF!","v":{"$error":"#REF!"}},{"$f":"#REF!","v":{"$error":"#REF!"}},{"$f":"#REF!","v":{"$error":"#REF!"}},{"$f":"#REF!","v":{"$error":"#REF!"}},{"$f":"#REF!","v":{"$error":"#REF!"}},{"$f":"#REF!","v":{"$error":"#REF!"}},{"$f":"#REF!","v":{"$error":"#REF!"}},{"$f":"#REF!","v":{"$error":"#REF!"}}]
[170,{"$f":"#REF!","v":{"$error":"#REF!"}},{"$f":"#REF!","v":{"$error":"#REF!"}},{"$f":"#REF!","v":{"$error":"#REF!"}},{"$f":"#REF!","v":{"$error":"#REF!"}},{"$f":"#REF!","v":{"$error":"#REF!"}},{"$f":"#REF!","v":{"$error":"#REF!"}},{"$f":"#REF!","v":{"$error":"#REF!"}},{"$f":"#REF!","v":{"$error":"#REF!"}},{"$f":"#REF!","v":{"$error":"#REF!"}},{"$f":"#REF!","v":{"$error":"#REF!"}},{"$f":"#REF!","v":{"$error":"#REF!"}},{"$f":"#REF!","v":{"$error":"#REF!"}},{"$f":"#REF!","v":{"$error":"#REF!"}},{"$f":"#REF!","v":{"$error":"#REF!"}},{"$f":"#REF!","v":{"$error":"#REF!"}},{"$f":"#REF!","v":{"$error":"#REF!"}},{"$f":"#REF!","v":{"$error":"#REF!"}},{"$f":"#REF!","v":{"$error":"#REF!"}},{"$f":"#REF!","v":{"$error":"#REF!"}},{"$f":"#REF!","v":{"$error":"#REF!"}},{"$f":"#REF!","v":{"$error":"#REF!"}},{"$f":"#REF!","v":{"$error":"#REF!"}}]
[180,{"$f":"#REF!","v":{"$error":"#REF!"}},{"$f":"#REF!","v":{"$error":"#REF!"}},{"$f":"#REF!","v":{"$error":"#REF!"}},{"$f":"#REF!","v":{"$error":"#REF!"}},{"$f":"#REF!","v":{"$error":"#REF!"}},{"$f":"#REF!","v":{"$error":"#REF!"}},{"$f":"#REF!","v":{"$error":"#REF!"}},{"$f":"#REF!","v":{"$error":"#REF!"}},{"$f":"#REF!","v":{"$error":"#REF!"}},{"$f":"#REF!","v":{"$error":"#REF!"}},{"$f":"#REF!","v":{"$error":"#REF!"}},{"$f":"#REF!","v":{"$error":"#REF!"}},{"$f":"#REF!","v":{"$error":"#REF!"}},{"$f":"#REF!","v":{"$error":"#REF!"}},{"$f":"#REF!","v":{"$error":"#REF!"}},{"$f":"#REF!","v":{"$error":"#REF!"}},{"$f":"#REF!","v":{"$error":"#REF!"}},{"$f":"#REF!","v":{"$error":"#REF!"}},{"$f":"#REF!","v":{"$error":"#REF!"}},{"$f":"#REF!","v":{"$error":"#REF!"}},{"$f":"#REF!","v":{"$error":"#REF!"}},{"$f":"#REF!","v":{"$error":"#REF!"}}]
[190,{"$f":"#REF!","v":{"$error":"#REF!"}},{"$f":"#REF!","v":{"$error":"#REF!"}},{"$f":"#REF!","v":{"$error":"#REF!"}},{"$f":"#REF!","v":{"$error":"#REF!"}},{"$f":"#REF!","v":{"$error":"#REF!"}},{"$f":"#REF!","v":{"$error":"#REF!"}},{"$f":"#REF!","v":{"$error":"#REF!"}},{"$f":"#REF!","v":{"$error":"#REF!"}},{"$f":"#REF!","v":{"$error":"#REF!"}},{"$f":"#REF!","v":{"$error":"#REF!"}},{"$f":"#REF!","v":{"$error":"#REF!"}},{"$f":"#REF!","v":{"$error":"#REF!"}},{"$f":"#REF!","v":{"$error":"#REF!"}},{"$f":"#REF!","v":{"$error":"#REF!"}},{"$f":"#REF!","v":{"$error":"#REF!"}},{"$f":"#REF!","v":{"$error":"#REF!"}},{"$f":"#REF!","v":{"$error":"#REF!"}},{"$f":"#REF!","v":{"$error":"#REF!"}},{"$f":"#REF!","v":{"$error":"#REF!"}},{"$f":"#REF!","v":{"$error":"#REF!"}},{"$f":"#REF!","v":{"$error":"#REF!"}},{"$f":"#REF!","v":{"$error":"#REF!"}}]
[200,{"$f":"#REF!","v":{"$error":"#REF!"}},{"$f":"#REF!","v":{"$error":"#REF!"}},{"$f":"#REF!","v":{"$error":"#REF!"}},{"$f":"#REF!","v":{"$error":"#REF!"}},{"$f":"#REF!","v":{"$error":"#REF!"}},{"$f":"#REF!","v":{"$error":"#REF!"}},{"$f":"#REF!","v":{"$error":"#REF!"}},{"$f":"#REF!","v":{"$error":"#REF!"}},{"$f":"#REF!","v":{"$error":"#REF!"}},{"$f":"#REF!","v":{"$error":"#REF!"}},{"$f":"#REF!","v":{"$error":"#REF!"}},{"$f":"#REF!","v":{"$error":"#REF!"}},{"$f":"#REF!","v":{"$error":"#REF!"}},{"$f":"#REF!","v":{"$error":"#REF!"}},{"$f":"#REF!","v":{"$error":"#REF!"}},{"$f":"#REF!","v":{"$error":"#REF!"}},{"$f":"#REF!","v":{"$error":"#REF!"}},{"$f":"#REF!","v":{"$error":"#REF!"}},{"$f":"#REF!","v":{"$error":"#REF!"}},{"$f":"#REF!","v":{"$error":"#REF!"}},{"$f":"#REF!","v":{"$error":"#REF!"}},{"$f":"#REF!","v":{"$error":"#REF!"}}]
[210,{"$f":"#REF!","v":{"$error":"#REF!"}},{"$f":"#REF!","v":{"$error":"#REF!"}},{"$f":"#REF!","v":{"$error":"#REF!"}},{"$f":"#REF!","v":{"$error":"#REF!"}},{"$f":"#REF!","v":{"$error":"#REF!"}},{"$f":"#REF!","v":{"$error":"#REF!"}},{"$f":"#REF!","v":{"$error":"#REF!"}},{"$f":"#REF!","v":{"$error":"#REF!"}},{"$f":"#REF!","v":{"$error":"#REF!"}},{"$f":"#REF!","v":{"$error":"#REF!"}},{"$f":"#REF!","v":{"$error":"#REF!"}},{"$f":"#REF!","v":{"$error":"#REF!"}},{"$f":"#REF!","v":{"$error":"#REF!"}},{"$f":"#REF!","v":{"$error":"#REF!"}},{"$f":"#REF!","v":{"$error":"#REF!"}},{"$f":"#REF!","v":{"$error":"#REF!"}},{"$f":"#REF!","v":{"$error":"#REF!"}},{"$f":"#REF!","v":{"$error":"#REF!"}},{"$f":"#REF!","v":{"$error":"#REF!"}},{"$f":"#REF!","v":{"$error":"#REF!"}},{"$f":"#REF!","v":{"$error":"#REF!"}},{"$f":"#REF!","v":{"$error":"#REF!"}}]
[220,{"$f":"#REF!","v":{"$error":"#REF!"}},{"$f":"#REF!","v":{"$error":"#REF!"}},{"$f":"#REF!","v":{"$error":"#REF!"}},{"$f":"#REF!","v":{"$error":"#REF!"}},{"$f":"#REF!","v":{"$error":"#REF!"}},{"$f":"#REF!","v":{"$error":"#REF!"}},{"$f":"#REF!","v":{"$error":"#REF!"}},{"$f":"#REF!","v":{"$error":"#REF!"}},{"$f":"#REF!","v":{"$error":"#REF!"}},{"$f":"#REF!","v":{"$error":"#REF!"}},{"$f":"#REF!","v":{"$error":"#REF!"}},{"$f":"#REF!","v":{"$error":"#REF!"}},{"$f":"#REF!","v":{"$error":"#REF!"}},{"$f":"#REF!","v":{"$error":"#REF!"}},{"$f":"#REF!","v":{"$error":"#REF!"}},{"$f":"#REF!","v":{"$error":"#REF!"}},{"$f":"#REF!","v":{"$error":"#REF!"}},{"$f":"#REF!","v":{"$error":"#REF!"}},{"$f":"#REF!","v":{"$error":"#REF!"}},{"$f":"#REF!","v":{"$error":"#REF!"}},{"$f":"#REF!","v":{"$error":"#REF!"}},{"$f":"#REF!","v":{"$error":"#REF!"}}]
[230,{"$f":"#REF!","v":{"$error":"#REF!"}},{"$f":"#REF!","v":{"$error":"#REF!"}},{"$f":"#REF!","v":{"$error":"#REF!"}},{"$f":"#REF!","v":{"$error":"#REF!"}},{"$f":"#REF!","v":{"$error":"#REF!"}},{"$f":"#REF!","v":{"$error":"#REF!"}},{"$f":"#REF!","v":{"$error":"#REF!"}},{"$f":"#REF!","v":{"$error":"#REF!"}},{"$f":"#REF!","v":{"$error":"#REF!"}},{"$f":"#REF!","v":{"$error":"#REF!"}},{"$f":"#REF!","v":{"$error":"#REF!"}},{"$f":"#REF!","v":{"$error":"#REF!"}},{"$f":"#REF!","v":{"$error":"#REF!"}},{"$f":"#REF!","v":{"$error":"#REF!"}},{"$f":"#REF!","v":{"$error":"#REF!"}},{"$f":"#REF!","v":{"$error":"#REF!"}},{"$f":"#REF!","v":{"$error":"#REF!"}},{"$f":"#REF!","v":{"$error":"#REF!"}},{"$f":"#REF!","v":{"$error":"#REF!"}},{"$f":"#REF!","v":{"$error":"#REF!"}},{"$f":"#REF!","v":{"$error":"#REF!"}},{"$f":"#REF!","v":{"$error":"#REF!"}}]
[240,{"$f":"#REF!","v":{"$error":"#REF!"}},{"$f":"#REF!","v":{"$error":"#REF!"}},{"$f":"#REF!","v":{"$error":"#REF!"}},{"$f":"#REF!","v":{"$error":"#REF!"}},{"$f":"#REF!","v":{"$error":"#REF!"}},{"$f":"#REF!","v":{"$error":"#REF!"}},{"$f":"#REF!","v":{"$error":"#REF!"}},{"$f":"#REF!","v":{"$error":"#REF!"}},{"$f":"#REF!","v":{"$error":"#REF!"}},{"$f":"#REF!","v":{"$error":"#REF!"}},{"$f":"#REF!","v":{"$error":"#REF!"}},{"$f":"#REF!","v":{"$error":"#REF!"}},{"$f":"#REF!","v":{"$error":"#REF!"}},{"$f":"#REF!","v":{"$error":"#REF!"}},{"$f":"#REF!","v":{"$error":"#REF!"}},{"$f":"#REF!","v":{"$error":"#REF!"}},{"$f":"#REF!","v":{"$error":"#REF!"}},{"$f":"#REF!","v":{"$error":"#REF!"}},{"$f":"#REF!","v":{"$error":"#REF!"}},{"$f":"#REF!","v":{"$error":"#REF!"}},{"$f":"#REF!","v":{"$error":"#REF!"}},{"$f":"#REF!","v":{"$error":"#REF!"}}]
[250,{"$f":"#REF!","v":{"$error":"#REF!"}},{"$f":"#REF!","v":{"$error":"#REF!"}},{"$f":"#REF!","v":{"$error":"#REF!"}},{"$f":"#REF!","v":{"$error":"#REF!"}},{"$f":"#REF!","v":{"$error":"#REF!"}},{"$f":"#REF!","v":{"$error":"#REF!"}},{"$f":"#REF!","v":{"$error":"#REF!"}},{"$f":"#REF!","v":{"$error":"#REF!"}},{"$f":"#REF!","v":{"$error":"#REF!"}},{"$f":"#REF!","v":{"$error":"#REF!"}},{"$f":"#REF!","v":{"$error":"#REF!"}},{"$f":"#REF!","v":{"$error":"#REF!"}},{"$f":"#REF!","v":{"$error":"#REF!"}},{"$f":"#REF!","v":{"$error":"#REF!"}},{"$f":"#REF!","v":{"$error":"#REF!"}},{"$f":"#REF!","v":{"$error":"#REF!"}},{"$f":"#REF!","v":{"$error":"#REF!"}},{"$f":"#REF!","v":{"$error":"#REF!"}},{"$f":"#REF!","v":{"$error":"#REF!"}},{"$f":"#REF!","v":{"$error":"#REF!"}},{"$f":"#REF!","v":{"$error":"#REF!"}},{"$f":"#REF!","v":{"$error":"#REF!"}}]
[260,{"$f":"#REF!","v":{"$error":"#REF!"}},{"$f":"#REF!","v":{"$error":"#REF!"}},{"$f":"#REF!","v":{"$error":"#REF!"}},{"$f":"#REF!","v":{"$error":"#REF!"}},{"$f":"#REF!","v":{"$error":"#REF!"}},{"$f":"#REF!","v":{"$error":"#REF!"}},{"$f":"#REF!","v":{"$error":"#REF!"}},{"$f":"#REF!","v":{"$error":"#REF!"}},{"$f":"#REF!","v":{"$error":"#REF!"}},{"$f":"#REF!","v":{"$error":"#REF!"}},{"$f":"#REF!","v":{"$error":"#REF!"}},{"$f":"#REF!","v":{"$error":"#REF!"}},{"$f":"#REF!","v":{"$error":"#REF!"}},{"$f":"#REF!","v":{"$error":"#REF!"}},{"$f":"#REF!","v":{"$error":"#REF!"}},{"$f":"#REF!","v":{"$error":"#REF!"}},{"$f":"#REF!","v":{"$error":"#REF!"}},{"$f":"#REF!","v":{"$error":"#REF!"}},{"$f":"#REF!","v":{"$error":"#REF!"}},{"$f":"#REF!","v":{"$error":"#REF!"}},{"$f":"#REF!","v":{"$error":"#REF!"}},{"$f":"#REF!","v":{"$error":"#REF!"}}]
[270,{"$f":"#REF!","v":{"$error":"#REF!"}},{"$f":"#REF!","v":{"$error":"#REF!"}},{"$f":"#REF!","v":{"$error":"#REF!"}},{"$f":"#REF!","v":{"$error":"#REF!"}},{"$f":"#REF!","v":{"$error":"#REF!"}},{"$f":"#REF!","v":{"$error":"#REF!"}},{"$f":"#REF!","v":{"$error":"#REF!"}},{"$f":"#REF!","v":{"$error":"#REF!"}},{"$f":"#REF!","v":{"$error":"#REF!"}},{"$f":"#REF!","v":{"$error":"#REF!"}},{"$f":"#REF!","v":{"$error":"#REF!"}},{"$f":"#REF!","v":{"$error":"#REF!"}},{"$f":"#REF!","v":{"$error":"#REF!"}},{"$f":"#REF!","v":{"$error":"#REF!"}},{"$f":"#REF!","v":{"$error":"#REF!"}},{"$f":"#REF!","v":{"$error":"#REF!"}},{"$f":"#REF!","v":{"$error":"#REF!"}},{"$f":"#REF!","v":{"$error":"#REF!"}},{"$f":"#REF!","v":{"$error":"#REF!"}},{"$f":"#REF!","v":{"$error":"#REF!"}},{"$f":"#REF!","v":{"$error":"#REF!"}},{"$f":"#REF!","v":{"$error":"#REF!"}}]
[280,{"$f":"#REF!","v":{"$error":"#REF!"}},{"$f":"#REF!","v":{"$error":"#REF!"}},{"$f":"#REF!","v":{"$error":"#REF!"}},{"$f":"#REF!","v":{"$error":"#REF!"}},{"$f":"#REF!","v":{"$error":"#REF!"}},{"$f":"#REF!","v":{"$error":"#REF!"}},{"$f":"#REF!","v":{"$error":"#REF!"}},{"$f":"#REF!","v":{"$error":"#REF!"}},{"$f":"#REF!","v":{"$error":"#REF!"}},{"$f":"#REF!","v":{"$error":"#REF!"}},{"$f":"#REF!","v":{"$error":"#REF!"}},{"$f":"#REF!","v":{"$error":"#REF!"}},{"$f":"#REF!","v":{"$error":"#REF!"}},{"$f":"#REF!","v":{"$error":"#REF!"}},{"$f":"#REF!","v":{"$error":"#REF!"}},{"$f":"#REF!","v":{"$error":"#REF!"}},{"$f":"#REF!","v":{"$error":"#REF!"}},{"$f":"#REF!","v":{"$error":"#REF!"}},{"$f":"#REF!","v":{"$error":"#REF!"}},{"$f":"#REF!","v":{"$error":"#REF!"}},{"$f":"#REF!","v":{"$error":"#REF!"}},{"$f":"#REF!","v":{"$error":"#REF!"}}]
[290,{"$f":"#REF!","v":{"$error":"#REF!"}},{"$f":"#REF!","v":{"$error":"#REF!"}},{"$f":"#REF!","v":{"$error":"#REF!"}},{"$f":"#REF!","v":{"$error":"#REF!"}},{"$f":"#REF!","v":{"$error":"#REF!"}},{"$f":"#REF!","v":{"$error":"#REF!"}},{"$f":"#REF!","v":{"$error":"#REF!"}},{"$f":"#REF!","v":{"$error":"#REF!"}},{"$f":"#REF!","v":{"$error":"#REF!"}},{"$f":"#REF!","v":{"$error":"#REF!"}},{"$f":"#REF!","v":{"$error":"#REF!"}},{"$f":"#REF!","v":{"$error":"#REF!"}},{"$f":"#REF!","v":{"$error":"#REF!"}},{"$f":"#REF!","v":{"$error":"#REF!"}},{"$f":"#REF!","v":{"$error":"#REF!"}},{"$f":"#REF!","v":{"$error":"#REF!"}},{"$f":"#REF!","v":{"$error":"#REF!"}},{"$f":"#REF!","v":{"$error":"#REF!"}},{"$f":"#REF!","v":{"$error":"#REF!"}},{"$f":"#REF!","v":{"$error":"#REF!"}},{"$f":"#REF!","v":{"$error":"#REF!"}},{"$f":"#REF!","v":{"$error":"#REF!"}}]
[300,{"$f":"#REF!","v":{"$error":"#REF!"}},{"$f":"#REF!","v":{"$error":"#REF!"}},{"$f":"#REF!","v":{"$error":"#REF!"}},{"$f":"#REF!","v":{"$error":"#REF!"}},{"$f":"#REF!","v":{"$error":"#REF!"}},{"$f":"#REF!","v":{"$error":"#REF!"}},{"$f":"#REF!","v":{"$error":"#REF!"}},{"$f":"#REF!","v":{"$error":"#REF!"}},{"$f":"#REF!","v":{"$error":"#REF!"}},{"$f":"#REF!","v":{"$error":"#REF!"}},{"$f":"#REF!","v":{"$error":"#REF!"}},{"$f":"#REF!","v":{"$error":"#REF!"}},{"$f":"#REF!","v":{"$error":"#REF!"}},{"$f":"#REF!","v":{"$error":"#REF!"}},{"$f":"#REF!","v":{"$error":"#REF!"}},{"$f":"#REF!","v":{"$error":"#REF!"}},{"$f":"#REF!","v":{"$error":"#REF!"}},{"$f":"#REF!","v":{"$error":"#REF!"}},{"$f":"#REF!","v":{"$error":"#REF!"}},{"$f":"#REF!","v":{"$error":"#REF!"}},{"$f":"#REF!","v":{"$error":"#REF!"}},{"$f":"#REF!","v":{"$error":"#REF!"}}]
[310,{"$f":"#REF!","v":{"$error":"#REF!"}},{"$f":"#REF!","v":{"$error":"#REF!"}},{"$f":"#REF!","v":{"$error":"#REF!"}},{"$f":"#REF!","v":{"$error":"#REF!"}},{"$f":"#REF!","v":{"$error":"#REF!"}},{"$f":"#REF!","v":{"$error":"#REF!"}},{"$f":"#REF!","v":{"$error":"#REF!"}},{"$f":"#REF!","v":{"$error":"#REF!"}},{"$f":"#REF!","v":{"$error":"#REF!"}},{"$f":"#REF!","v":{"$error":"#REF!"}},{"$f":"#REF!","v":{"$error":"#REF!"}},{"$f":"#REF!","v":{"$error":"#REF!"}},{"$f":"#REF!","v":{"$error":"#REF!"}},{"$f":"#REF!","v":{"$error":"#REF!"}},{"$f":"#REF!","v":{"$error":"#REF!"}},{"$f":"#REF!","v":{"$error":"#REF!"}},{"$f":"#REF!","v":{"$error":"#REF!"}},{"$f":"#REF!","v":{"$error":"#REF!"}},{"$f":"#REF!","v":{"$error":"#REF!"}},{"$f":"#REF!","v":{"$error":"#REF!"}},{"$f":"#REF!","v":{"$error":"#REF!"}},{"$f":"#REF!","v":{"$error":"#REF!"}}]
[320,{"$f":"#REF!","v":{"$error":"#REF!"}},{"$f":"#REF!","v":{"$error":"#REF!"}},{"$f":"#REF!","v":{"$error":"#REF!"}},{"$f":"#REF!","v":{"$error":"#REF!"}},{"$f":"#REF!","v":{"$error":"#REF!"}},{"$f":"#REF!","v":{"$error":"#REF!"}},{"$f":"#REF!","v":{"$error":"#REF!"}},{"$f":"#REF!","v":{"$error":"#REF!"}},{"$f":"#REF!","v":{"$error":"#REF!"}},{"$f":"#REF!","v":{"$error":"#REF!"}},{"$f":"#REF!","v":{"$error":"#REF!"}},{"$f":"#REF!","v":{"$error":"#REF!"}},{"$f":"#REF!","v":{"$error":"#REF!"}},{"$f":"#REF!","v":{"$error":"#REF!"}},{"$f":"#REF!","v":{"$error":"#REF!"}},{"$f":"#REF!","v":{"$error":"#REF!"}},{"$f":"#REF!","v":{"$error":"#REF!"}},{"$f":"#REF!","v":{"$error":"#REF!"}},{"$f":"#REF!","v":{"$error":"#REF!"}},{"$f":"#REF!","v":{"$error":"#REF!"}},{"$f":"#REF!","v":{"$error":"#REF!"}},{"$f":"#REF!","v":{"$error":"#REF!"}}]
[330,{"$f":"#REF!","v":{"$error":"#REF!"}},{"$f":"#REF!","v":{"$error":"#REF!"}},{"$f":"#REF!","v":{"$error":"#REF!"}},{"$f":"#REF!","v":{"$error":"#REF!"}},{"$f":"#REF!","v":{"$error":"#REF!"}},{"$f":"#REF!","v":{"$error":"#REF!"}},{"$f":"#REF!","v":{"$error":"#REF!"}},{"$f":"#REF!","v":{"$error":"#REF!"}},{"$f":"#REF!","v":{"$error":"#REF!"}},{"$f":"#REF!","v":{"$error":"#REF!"}},{"$f":"#REF!","v":{"$error":"#REF!"}},{"$f":"#REF!","v":{"$error":"#REF!"}},{"$f":"#REF!","v":{"$error":"#REF!"}},{"$f":"#REF!","v":{"$error":"#REF!"}},{"$f":"#REF!","v":{"$error":"#REF!"}},{"$f":"#REF!","v":{"$error":"#REF!"}},{"$f":"#REF!","v":{"$error":"#REF!"}},{"$f":"#REF!","v":{"$error":"#REF!"}},{"$f":"#REF!","v":{"$error":"#REF!"}},{"$f":"#REF!","v":{"$error":"#REF!"}},{"$f":"#REF!","v":{"$error":"#REF!"}},{"$f":"#REF!","v":{"$error":"#REF!"}}]
[340,{"$f":"#REF!","v":{"$error":"#REF!"}},{"$f":"#REF!","v":{"$error":"#REF!"}},{"$f":"#REF!","v":{"$error":"#REF!"}},{"$f":"#REF!","v":{"$error":"#REF!"}},{"$f":"#REF!","v":{"$error":"#REF!"}},{"$f":"#REF!","v":{"$error":"#REF!"}},{"$f":"#REF!","v":{"$error":"#REF!"}},{"$f":"#REF!","v":{"$error":"#REF!"}},{"$f":"#REF!","v":{"$error":"#REF!"}},{"$f":"#REF!","v":{"$error":"#REF!"}},{"$f":"#REF!","v":{"$error":"#REF!"}},{"$f":"#REF!","v":{"$error":"#REF!"}},{"$f":"#REF!","v":{"$error":"#REF!"}},{"$f":"#REF!","v":{"$error":"#REF!"}},{"$f":"#REF!","v":{"$error":"#REF!"}},{"$f":"#REF!","v":{"$error":"#REF!"}},{"$f":"#REF!","v":{"$error":"#REF!"}},{"$f":"#REF!","v":{"$error":"#REF!"}},{"$f":"#REF!","v":{"$error":"#REF!"}},{"$f":"#REF!","v":{"$error":"#REF!"}},{"$f":"#REF!","v":{"$error":"#REF!"}},{"$f":"#REF!","v":{"$error":"#REF!"}}]
[350,{"$f":"#REF!","v":{"$error":"#REF!"}},{"$f":"#REF!","v":{"$error":"#REF!"}},{"$f":"#REF!","v":{"$error":"#REF!"}},{"$f":"#REF!","v":{"$error":"#REF!"}},{"$f":"#REF!","v":{"$error":"#REF!"}},{"$f":"#REF!","v":{"$error":"#REF!"}},{"$f":"#REF!","v":{"$error":"#REF!"}},{"$f":"#REF!","v":{"$error":"#REF!"}},{"$f":"#REF!","v":{"$error":"#REF!"}},{"$f":"#REF!","v":{"$error":"#REF!"}},{"$f":"#REF!","v":{"$error":"#REF!"}},{"$f":"#REF!","v":{"$error":"#REF!"}},{"$f":"#REF!","v":{"$error":"#REF!"}},{"$f":"#REF!","v":{"$error":"#REF!"}},{"$f":"#REF!","v":{"$error":"#REF!"}},{"$f":"#REF!","v":{"$error":"#REF!"}},{"$f":"#REF!","v":{"$error":"#REF!"}},{"$f":"#REF!","v":{"$error":"#REF!"}},{"$f":"#REF!","v":{"$error":"#REF!"}},{"$f":"#REF!","v":{"$error":"#REF!"}},{"$f":"#REF!","v":{"$error":"#REF!"}},{"$f":"#REF!","v":{"$error":"#REF!"}}]
[360,{"$f":"#REF!","v":{"$error":"#REF!"}},{"$f":"#REF!","v":{"$error":"#REF!"}},{"$f":"#REF!","v":{"$error":"#REF!"}},{"$f":"#REF!","v":{"$error":"#REF!"}},{"$f":"#REF!","v":{"$error":"#REF!"}},{"$f":"#REF!","v":{"$error":"#REF!"}},{"$f":"#REF!","v":{"$error":"#REF!"}},{"$f":"#REF!","v":{"$error":"#REF!"}},{"$f":"#REF!","v":{"$error":"#REF!"}},{"$f":"#REF!","v":{"$error":"#REF!"}},{"$f":"#REF!","v":{"$error":"#REF!"}},{"$f":"#REF!","v":{"$error":"#REF!"}},{"$f":"#REF!","v":{"$error":"#REF!"}},{"$f":"#REF!","v":{"$error":"#REF!"}},{"$f":"#REF!","v":{"$error":"#REF!"}},{"$f":"#REF!","v":{"$error":"#REF!"}},{"$f":"#REF!","v":{"$error":"#REF!"}},{"$f":"#REF!","v":{"$error":"#REF!"}},{"$f":"#REF!","v":{"$error":"#REF!"}},{"$f":"#REF!","v":{"$error":"#REF!"}},{"$f":"#REF!","v":{"$error":"#REF!"}},{"$f":"#REF!","v":{"$error":"#REF!"}}]
[370,{"$f":"#REF!","v":{"$error":"#REF!"}},{"$f":"#REF!","v":{"$error":"#REF!"}},{"$f":"#REF!","v":{"$error":"#REF!"}},{"$f":"#REF!","v":{"$error":"#REF!"}},{"$f":"#REF!","v":{"$error":"#REF!"}},{"$f":"#REF!","v":{"$error":"#REF!"}},{"$f":"#REF!","v":{"$error":"#REF!"}},{"$f":"#REF!","v":{"$error":"#REF!"}},{"$f":"#REF!","v":{"$error":"#REF!"}},{"$f":"#REF!","v":{"$error":"#REF!"}},{"$f":"#REF!","v":{"$error":"#REF!"}},{"$f":"#REF!","v":{"$error":"#REF!"}},{"$f":"#REF!","v":{"$error":"#REF!"}},{"$f":"#REF!","v":{"$error":"#REF!"}},{"$f":"#REF!","v":{"$error":"#REF!"}},{"$f":"#REF!","v":{"$error":"#REF!"}},{"$f":"#REF!","v":{"$error":"#REF!"}},{"$f":"#REF!","v":{"$error":"#REF!"}},{"$f":"#REF!","v":{"$error":"#REF!"}},{"$f":"#REF!","v":{"$error":"#REF!"}},{"$f":"#REF!","v":{"$error":"#REF!"}},{"$f":"#REF!","v":{"$error":"#REF!"}}]
[380,{"$f":"#REF!","v":{"$error":"#REF!"}},{"$f":"#REF!","v":{"$error":"#REF!"}},{"$f":"#REF!","v":{"$error":"#REF!"}},{"$f":"#REF!","v":{"$error":"#REF!"}},{"$f":"#REF!","v":{"$error":"#REF!"}},{"$f":"#REF!","v":{"$error":"#REF!"}},{"$f":"#REF!","v":{"$error":"#REF!"}},{"$f":"#REF!","v":{"$error":"#REF!"}},{"$f":"#REF!","v":{"$error":"#REF!"}},{"$f":"#REF!","v":{"$error":"#REF!"}},{"$f":"#REF!","v":{"$error":"#REF!"}},{"$f":"#REF!","v":{"$error":"#REF!"}},{"$f":"#REF!","v":{"$error":"#REF!"}},{"$f":"#REF!","v":{"$error":"#REF!"}},{"$f":"#REF!","v":{"$error":"#REF!"}},{"$f":"#REF!","v":{"$error":"#REF!"}},{"$f":"#REF!","v":{"$error":"#REF!"}},{"$f":"#REF!","v":{"$error":"#REF!"}},{"$f":"#REF!","v":{"$error":"#REF!"}},{"$f":"#REF!","v":{"$error":"#REF!"}},{"$f":"#REF!","v":{"$error":"#REF!"}},{"$f":"#REF!","v":{"$error":"#REF!"}}]
[390,{"$f":"#REF!","v":{"$error":"#REF!"}},{"$f":"#REF!","v":{"$error":"#REF!"}},{"$f":"#REF!","v":{"$error":"#REF!"}},{"$f":"#REF!","v":{"$error":"#REF!"}},{"$f":"#REF!","v":{"$error":"#REF!"}},{"$f":"#REF!","v":{"$error":"#REF!"}},{"$f":"#REF!","v":{"$error":"#REF!"}},{"$f":"#REF!","v":{"$error":"#REF!"}},{"$f":"#REF!","v":{"$error":"#REF!"}},{"$f":"#REF!","v":{"$error":"#REF!"}},{"$f":"#REF!","v":{"$error":"#REF!"}},{"$f":"#REF!","v":{"$error":"#REF!"}},{"$f":"#REF!","v":{"$error":"#REF!"}},{"$f":"#REF!","v":{"$error":"#REF!"}},{"$f":"#REF!","v":{"$error":"#REF!"}},{"$f":"#REF!","v":{"$error":"#REF!"}},{"$f":"#REF!","v":{"$error":"#REF!"}},{"$f":"#REF!","v":{"$error":"#REF!"}},{"$f":"#REF!","v":{"$error":"#REF!"}},{"$f":"#REF!","v":{"$error":"#REF!"}},{"$f":"#REF!","v":{"$error":"#REF!"}},{"$f":"#REF!","v":{"$error":"#REF!"}}]
[400,{"$f":"#REF!","v":{"$error":"#REF!"}},{"$f":"#REF!","v":{"$error":"#REF!"}},{"$f":"#REF!","v":{"$error":"#REF!"}},{"$f":"#REF!","v":{"$error":"#REF!"}},{"$f":"#REF!","v":{"$error":"#REF!"}},{"$f":"#REF!","v":{"$error":"#REF!"}},{"$f":"#REF!","v":{"$error":"#REF!"}},{"$f":"#REF!","v":{"$error":"#REF!"}},{"$f":"#REF!","v":{"$error":"#REF!"}},{"$f":"#REF!","v":{"$error":"#REF!"}},{"$f":"#REF!","v":{"$error":"#REF!"}},{"$f":"#REF!","v":{"$error":"#REF!"}},{"$f":"#REF!","v":{"$error":"#REF!"}},{"$f":"#REF!","v":{"$error":"#REF!"}},{"$f":"#REF!","v":{"$error":"#REF!"}},{"$f":"#REF!","v":{"$error":"#REF!"}},{"$f":"#REF!","v":{"$error":"#REF!"}},{"$f":"#REF!","v":{"$error":"#REF!"}},{"$f":"#REF!","v":{"$error":"#REF!"}},{"$f":"#REF!","v":{"$error":"#REF!"}},{"$f":"#REF!","v":{"$error":"#REF!"}},{"$f":"#REF!","v":{"$error":"#REF!"}}]

{"sheet":"Cennik SUPER PRICE","index":7,"n_rows":276,"n_cols":29,"rows_kept":276,"merged":[[43,1,44,1],[86,1,87,1],[129,1,130,1],[172,1,173,1],[215,1,216,1],[258,1,259,1],[261,1,261,28]]}
[{"$nulls":4},"CENNIK ROLET RZYMSKICH SUPERPRICE"]
[]
[]
[null,"GRUPA 1"]
[null,null,40,50,60,70,80,90,100,110,120,130,140,150,160,170,180,190,200,210,220,230,240,250,260,270,280,290,300]
[null,40,195,199,203,219,223,232,236,241,261,266,270,279,288,299,308,312,317,327,338,342,350,358,366]
[null,50,196,201,206,222,226,236,241,245,266,271,276,285,295,306,316,320,325,336,347,352,360,368,376]
[null,60,198,203,208,225,230,240,245,250,271,277,282,292,302,313,323,328,333,345,357,362,372,382,392]
[null,70,200,205,211,228,233,244,249,255,277,282,287,298,308,320,331,336,342,354,366,371,381,391,401]
[null,80,202,208,213,231,237,248,253,259,282,288,293,304,315,328,338,344,350,363,375,381,393,405,417]
[null,90,203,210,216,234,240,251,258,264,287,293,299,311,322,335,346,352,359,372,384,391,403,415,427]
[null,100,205,212,219,237,244,255,262,269,292,299,305,317,329,342,354,360,367,380,394,400,412,424,436]
[null,110,207,214,221,240,247,259,266,273,297,304,311,323,335,349,361,368,375,389,403,410,423,436,449]
[null,120,209,216,224,243,250,263,270,278,302,310,317,330,342,356,369,376,384,398,412,420,433,446,459]
[null,130,210,218,226,246,254,267,275,283,307,315,323,336,349,363,376,384,392,407,421,429,443,457,471]
[null,140,212,221,229,249,257,271,279,287,312,321,329,342,356,371,384,392,401,416,431,439,453,467,481]
[null,150,214,223,231,252,261,274,283,292,317,326,335,349,362,378,391,400,409,424,440,449,464,479,494]
[null,160,216,225,234,255,264,278,287,297,322,332,341,355,369,385,399,408,417,433,449,458,473,488,503]
[null,170,217,227,237,258,267,282,292,301,327,337,347,361,376,392,407,416,426,442,458,468,483,498,513]
[null,180,219,229,239,261,271,286,296,306,333,343,352,367,383,399,414,424,434,451,468,478,494,510,526]
[null,190,221,231,242,264,274,290,300,310,338,348,358,374,389,406,422,432,443,460,477,487,503,519,535]
[null,200,223,234,244,267,278,294,304,315,343,353,364,380,396,414,429,440,451,468,486,497,514,531,548]
[null,210,224,236,247,270,281,297,309,320,348,359,370,386,403,421,437,448,459,477,495,506,523,540,557]
[null,220,226,238,249,273,285,301,313,324,353,364,376,393,409,428,445,456,468,486,505,516,533,550,567]
[null,230,228,240,252,276,288,305,317,329,358,370,382,399,416,435,452,464,476,495,514,526,544,562,580]
[null,240,230,242,255,279,291,309,321,334,363,375,388,405,423,442,460,472,485,504,523,535,553,571,589]
[null,250,231,244,257,282,295,313,326,338,368,381,394,412,430,449,467,480,493,513,532,545,564,583,602]
[null,260,233,246,260,285,298,317,330,343,373,386,400,418,436,457,475,488,501,521,542,555,574,593,612]
[null,270]
[null,280]
[null,290]
[null,300]
[null,310]
[null,320]
[null,330]
[null,340]
[null,350]
[null,360]
[null,370]
[null,380]
[null,390]
[null,400]
[]
[null,"Tkaniny: ","Firany: VIPER, LEVANTE, ASTRA, ITALIA,CARRERA, CAYENNE MACAN   "]
[null,null,"Zasłony: TESTAROSSA"]
[]
[null,"GRUPA 2"]
[null,null,40,50,60,70,80,90,100,110,120,130,140,150,160,170,180,190,200,210,220,230,240,250,260,270,280,290,300]
[null,40,196,201,206,222,227,236,241,246,267,271,276,286,295,306,316,321,325,337,348,353,363,373,383]
[null,50,199,204,209,226,231,241,246,251,273,278,283,294,304,315,326,331,336,348,360,365,375,385,395]
[null,60,201,207,212,229,235,246,252,257,279,285,291,302,312,325,335,341,347,359,371,377,389,401,413]
[null,70,203,209,216,233,239,251,257,263,286,292,298,310,321,334,345,351,357,370,383,389,401,413,425]
[null,80,205,212,219,237,244,256,262,269,292,299,306,318,329,343,354,361,368,381,395,401,413,425,437]
[null,90,207,215,222,241,248,260,268,275,299,306,313,326,338,352,364,371,379,393,406,414,430,446,462]
[null,100,210,217,225,245,252,265,273,281,305,313,321,334,346,361,374,381,389,404,418,426,442,458,474]
[null,110,212,220,228,248,257,270,278,287,312,320,328,342,355,370,383,391,400,415,430,438,454,470,486]
[null,120,214,223,232,252,261,275,284,293,318,327,336,350,363,379,393,402,410,426,441,450,468,486,504]
[null,130,216,226,235,256,265,280,289,298,324,334,343,358,372,388,402,412,421,437,453,462,480,498,516]
[null,140,218,228,238,260,270,285,294,304,331,341,351,366,380,397,412,422,432,448,465,475,495,515,535]
[null,150,221,231,241,264,274,289,300,310,337,348,358,374,389,406,421,432,442,459,476,487,507,527,547]
[null,160,223,234,245,267,278,294,305,316,344,355,366,382,397,415,431,442,453,471,488,499,519,539,559]
[null,170,225,236,248,271,283,299,310,322,350,362,373,389,406,424,441,452,464,482,500,511,531,551,571]
[null,180,227,239,251,275,287,304,316,328,357,369,380,397,415,433,450,462,474,493,512,524,544,564,584]
[null,190,229,242,254,279,291,309,321,334,363,375,388,405,423,442,460,472,485,504,523,536,557,578,599]
[null,200,232,245,258,282,295,314,327,340,369,382,395,413,432,451,469,482,495,515,535,548,569,590,611]
[null,210,234,247,261,286,300,318,332,345,376,389,403,421,440,460,479,492,506,526,547,560,581,602,623]
[null,220,236,250,264,290,304,323,337,351,382,396,410,429,449,469,489,503,517,537,558,572,594,616,638]
[null,230,238,253,267,294,308,328,343,357,389,403,418,437,457,478,498,513,527,549,570,585,608,631,654]
[null,240,240,256,271,298,313,333,348,363,395,410,425,445,466,488,508,523,538,560,582,597,620,643,666]
[null,250,243,258,274,301,317,338,353,369,401,417,433,453,474,497,517,533,549,571,593,609,633,657,681]
[null,260,245,261,277,305,321,343,359,375,408,424,440,461,483,506,527,543,559,582,605,621,645,669,693]
[null,270]
[null,280]
[null,290]
[null,300]
[null,310]
[null,320]
[null,330]
[null,340]
[null,350]
[null,360]
[null,370]
[null,380]
[null,390]
[null,400]
[]
[null,"Tkaniny: ","Firany: VEYRON, HURACAN, VOGUE"]
[null,null,"Zasłony: MASTER"]
[]
[null,"GRUPA 3"]
[null,null,40,50,60,70,80,90,100,110,120,130,140,150,160,170,180,190,200,210,220,230,240,250,260,270,280,290,300]
[null,40,198,203,208,225,230,240,245,250,272,277,282,292,302,314,324,329,334,346,358,363,387,411,435]
[null,50,201,207,212,230,235,246,252,258,280,285,291,302,313,325,336,341,347,360,372,378,402,426,450]
[null,60,204,210,216,234,241,252,258,265,287,294,300,312,323,336,347,354,360,373,386,392,418,444,470]
[null,70,206,213,220,239,246,258,265,272,295,302,309,321,333,347,359,366,373,387,400,407,433,459,485]
[null,80,209,216,224,243,251,264,271,279,303,311,318,331,344,358,370,378,386,400,414,422,450,478,506]
[null,90,211,220,228,248,256,269,278,286,311,319,327,341,354,369,382,390,399,414,428,437,465,493,521]
[null,100,214,223,232,252,261,275,284,293,318,327,336,350,364,380,394,402,411,427,442,451,481,511,541]
[null,110,217,226,236,257,266,281,291,300,326,336,345,360,374,391,405,415,424,440,457,466,500,534,568]
[null,120,219,230,240,262,272,287,297,307,334,344,354,370,385,402,417,427,437,454,471,481,515,549,583]
[null,130,222,233,244,266,277,293,304,314,342,353,363,379,395,412,428,439,450,467,485,496,532,568,604]
[null,140,225,236,248,271,282,299,310,321,349,361,372,389,405,423,440,451,463,481,499,510,546,582,618]
[null,150,227,239,251,275,287,304,316,329,357,369,381,399,416,434,451,464,476,494,513,525,563,601,639]
[null,160,230,243,255,280,292,310,323,336,365,378,390,408,426,445,463,476,488,508,527,540,578,616,654]
[null,170,233,246,259,284,298,316,329,343,373,386,399,418,436,456,475,488,501,521,541,555,595,635,675]
[null,180,235,249,263,289,303,322,336,350,381,395,408,427,447,467,486,500,514,535,556,570,612,654,696]
[null,190,238,252,267,293,308,328,342,357,388,403,418,437,457,478,498,512,527,548,570,584,628,672,716]
[null,200,240,256,271,298,313,334,349,364,396,411,427,447,467,489,509,525,540,562,584,599,643,687,731]
[null,210,243,259,275,303,318,339,355,371,404,420,436,456,477,500,521,537,553,575,598,614,660,706,752]
[null,220,246,262,279,307,324,345,362,378,412,428,445,466,488,511,533,549,566,589,612,629,675,721,767]
[null,230,248,266,283,312,329,351,368,385,419,436,454,476,498,522,544,561,578,602,626,643,691,739,787]
[null,240,251,269,287,316,334,357,375,392,427,445,463,485,508,533,556,573,591,616,640,658,706,754,802]
[null,250,254,272,291,321,339,363,381,400,435,453,472,495,519,544,567,586,604,629,654,673,723,773,823]
[null,260,256,275,294,325,344,369,388,407,443,462,481,505,529,555,579,598,617,643,669,688,740,792,844]
[null,270]
[null,280]
[null,290]
[null,300]
[null,310]
[null,320]
[null,330]
[null,340]
[null,350]
[null,360]
[null,370]
[null,380]
[null,390]
[null,400]
[]
[null,"Tkaniny: ","Firany: CONTINENTAL, PATHFINDER"]
[null,null,"Zasłony: NIVA, NESTOR, MUSTANG, BEETLE, MISTRAL, PHNATOM, GHOST, CORNICHE, MONTE CARLO, ROYAL MONACO, LINCOLN, SONETT"]
[]
[null,"GRUPA 4"]
[null,null,40,50,60,70,80,90,100,110,120,130,140,150,160,170,180,190,200,210,220,230,240,250,260,270,280,290,300]
[null,40,200,206,211,228,234,244,250,255,277,283,288,299,310,322,332,338,343,355,367,373,397,421,445]
[null,50,203,209,216,233,240,251,257,264,286,293,299,310,322,334,346,352,358,371,384,390,416,442,468]
[null,60,206,213,220,239,246,258,265,272,295,303,310,322,334,347,359,366,373,387,401,408,436,464,492]
[null,70,209,217,225,244,252,265,273,280,305,312,320,333,346,360,373,381,388,403,417,425,453,481,509]
[null,80,212,221,229,249,258,272,280,289,314,322,331,344,358,373,386,395,403,419,434,442,472,502,532]
[null,90,215,225,234,255,264,278,288,297,323,332,341,356,370,386,400,409,419,435,450,460,490,520,550]
[null,100,219,229,239,260,270,285,295,305,332,342,352,367,382,399,414,424,434,450,467,477,511,545,579]
[null,110,222,232,243,265,276,292,303,314,341,352,362,378,394,411,427,438,449,466,483,494,528,562,596]
[null,120,225,236,248,271,282,299,310,322,350,362,373,390,406,424,441,452,464,482,500,512,548,584,620]
[null,130,228,240,252,276,288,306,318,330,359,371,384,401,418,437,454,467,479,498,517,529,567,605,643]
[null,140,231,244,257,282,295,313,326,339,368,381,394,412,430,450,468,481,494,514,533,546,584,622,660]
[null,150,234,248,261,287,301,319,333,347,377,391,405,424,442,463,481,495,509,529,550,564,606,648,690]
[null,160,237,252,266,292,307,326,341,355,386,401,415,435,454,476,495,510,524,545,566,581,623,665,707]
[null,170,240,255,271,298,313,333,348,364,395,411,426,446,466,488,509,524,539,561,583,598,642,686,730]
[null,180,243,259,275,303,319,340,356,372,405,420,436,457,479,501,522,538,554,577,600,616,662,708,754]
[null,190,246,263,280,308,325,347,363,380,414,430,447,469,491,514,536,553,569,593,616,633,679,725,771]
[null,200,249,267,284,314,331,354,371,388,423,440,458,480,503,527,549,567,584,608,633,650,700,750,800]
[null,210,252,271,289,319,337,360,379,397,432,450,468,491,515,540,563,581,599,624,649,667,717,767,817]
[null,220,256,275,293,324,343,367,386,405,441,460,479,503,527,553,577,595,614,640,666,685,737,789,841]
[null,230,259,278,298,330,349,374,394,413,450,470,489,514,539,565,590,610,630,656,682,702,754,806,858]
[null,240,262,282,303,335,355,381,401,422,459,479,500,525,551,578,604,624,645,672,699,719,773,827,881]
[null,250,265,286,307,340,361,388,409,430,468,489,511,537,563,591,617,638,660,688,716,737,793,849,905]
[null,260,268,290,312,346,368,395,416,438,477,499,521,548,575,604,631,653,675,703,732,754,812,870,928]
[null,270]
[null,280]
[null,290]
[null,300]
[null,310]
[null,320]
[null,330]
[null,340]
[null,350]
[null,360]
[null,370]
[null,380]
[null,390]
[null,400]
[]
[null,"Tkaniny: ","Firany: brak"]
[null,null,"Zasłony: LEOPARD, DE VILLE, WRANGLER, CAMARO"]
[]
[null,"GRUPA 5"]
[null,null,40,50,60,70,80,90,100,110,120,130,140,150,160,170,180,190,200,210,220,230,240,250,260]
[null,40,202,208,214,231,237,248,254,260,283,289,295,306,317,329,340,346,352,365,377,383,395,407,419]
[null,50,205,212,219,237,244,256,263,270,293,300,307,319,331,344,356,363,369,383,396,403,417,431,445]
[null,60,209,217,224,243,251,264,272,279,303,311,319,332,344,359,371,379,387,401,415,423,439,455,471]
[null,70,212,221,230,250,258,272,280,289,314,322,331,345,358,373,387,395,404,419,434,443,461,479,497]
[null,80,216,225,235,256,265,280,289,298,324,334,343,358,372,388,402,412,421,437,453,463,483,503,523]
[null,90,219,230,240,262,272,287,298,308,335,345,355,371,386,403,418,428,439,456,472,483,505,527,549]
[null,100,223,234,245,268,279,295,306,317,345,356,367,384,400,417,434,445,456,474,491,502,524,546,568]
[null,110,226,238,250,274,286,303,315,327,356,368,380,397,414,432,449,461,473,492,510,522,546,570,594]
[null,120,230,243,256,280,293,311,324,337,366,379,392,410,427,447,465,478,490,510,529,542,568,594,620]
[null,130,234,247,261,286,300,319,332,346,376,390,404,423,441,462,480,494,508,528,548,562,590,618,646]
[null,140,237,252,266,292,307,327,341,356,387,401,416,436,455,476,496,510,525,546,567,582,612,642,672]
[null,150,241,256,271,299,314,334,350,365,397,413,428,449,469,491,511,527,542,564,586,602,634,666,698]
[null,160,244,260,277,305,321,342,358,375,408,424,440,461,483,506,527,543,560,583,605,622,656,690,724]
[null,170,248,265,282,311,328,350,367,384,418,435,452,474,497,520,543,560,577,601,624,642,678,714,750]
[null,180,251,269,287,317,335,358,376,394,428,446,464,487,510,535,558,576,594,619,644,662,698,734,770]
[null,190,255,274,292,323,342,366,385,403,439,458,477,500,524,550,574,593,611,637,663,681,717,753,789]
[null,200,258,278,298,329,349,374,393,413,449,469,489,513,538,565,589,609,629,655,682,701,739,777,815]
[null,210,262,282,303,335,356,381,402,422,460,480,501,526,552,579,605,625,646,673,701,721,761,801,841]
[null,220,265,287,308,341,363,389,411,432,470,492,513,539,566,594,620,642,663,691,720,741,783,825,867]
[null,230,269,291,313,347,370,397,419,442,481,503,525,552,580,609,636,658,681,710,739,761,805,849,893]
[null,240,272,295,319,354,377,405,428,451,491,514,537,565,594,624,652,675,698,728,758,781,827,873,919]
[null,250,276,300,324,360,384,413,437,461,501,525,549,578,607,638,667,691,715,746,777,801,849,897,945]
[null,260,279,304,329,366,391,420,445,470,512,537,562,591,621,653,683,708,732,764,796,821,871,921,971]
[null,270]
[null,280]
[null,290]
[null,300]
[null,310]
[null,320]
[null,330]
[null,340]
[null,350]
[null,360]
[null,370]
[null,380]
[null,390]
[null,400]
[]
[null,"Tkaniny: ","Firany: brak"]
[null,null,"Zasłony: DEYTONA, SIBER"]
[]
[null,"Grupa  6"]
[null,null,40,50,60,70,80,90,100,110,120,130,140,150,160,170,180,190,200,210,220,230,240,250,260,270,280,290,300]
[null,40,204,210,216,234,241,252,259,265,288,294,301,312,324,337,348,355,361,374,387,393,405,417,429]
[null,50,208,215,222,241,249,261,268,276,300,307,315,327,339,353,366,373,381,395,408,416,432,448,464]
[null,60,212,220,228,248,257,270,278,287,311,320,328,342,355,370,383,392,400,415,430,438,454,470,486]
[null,70,215,225,234,255,264,279,288,297,323,333,342,356,371,386,401,410,420,436,451,461,481,501,521]
[null,80,219,230,240,262,272,288,298,308,335,345,356,371,386,403,418,429,439,456,473,483,503,523,543]
[null,90,223,235,246,269,280,296,308,319,347,358,369,386,402,420,436,447,459,477,494,506,530,554,578]
[null,100,227,240,252,276,288,305,317,330,358,371,383,400,418,436,454,466,478,497,516,528,552,576,600]
[null,110,231,245,258,283,296,314,327,340,370,383,397,415,433,453,471,484,498,517,537,550,576,602,628]
[null,120,235,250,264,290,304,323,337,351,382,396,410,430,449,470,489,503,517,538,559,573,601,629,657]
[null,130,239,254,270,296,312,332,347,362,394,409,424,444,464,486,506,521,537,558,580,595,625,655,685]
[null,140,243,259,276,303,319,341,357,373,405,422,438,459,480,503,524,540,556,579,602,618,650,682,714]
[null,150,247,264,281,310,327,349,366,384,417,434,451,474,496,519,541,559,576,599,623,640,674,708,742]
[null,160,251,269,287,317,335,358,376,394,429,447,465,488,511,536,559,577,595,620,645,663,699,735,771]
[null,170,255,274,293,324,343,367,386,405,441,460,479,503,527,553,577,596,615,640,666,685,723,761,799]
[null,180,259,279,299,331,351,376,396,416,453,473,492,517,543,569,594,614,634,661,688,708,748,788,828]
[null,190,263,284,305,338,359,385,406,427,464,485,506,532,558,586,612,633,654,681,709,730,772,814,856]
[null,200,267,289,311,345,367,394,415,437,476,498,520,547,574,602,629,651,673,702,730,752,796,840,884]
[null,210,271,294,317,352,374,402,425,448,488,511,534,561,589,619,647,670,693,722,752,775,821,867,913]
[null,220,275,299,323,358,382,411,435,459,500,523,547,576,605,636,665,688,712,743,773,797,845,893,941]
[null,230,279,304,329,365,390,420,445,470,511,536,561,591,621,652,682,707,732,763,795,820,870,920,970]
[null,240,283,309,335,372,398,429,455,480,523,549,575,605,636,669,700,725,751,784,816,842,894,946,998]
[null,250,287,314,341,379,406,438,464,491,535,562,588,620,652,685,717,744,771,804,838,865,919,973,1027]
[null,260,291,319,346,386,414,447,474,502,547,574,602,635,667,702,735,763,790,825,859,887,943,999,1055]
[null,270]
[null,280]
[null,290]
[null,300]
[null,310]
[null,320]
[null,330]
[null,340]
[null,350]
[null,360]
[null,370]
[null,380]
[null,390]
[null,400]
[]
[null,"Tkaniny: ","Firany: AVENTADOR"]
[null,null,"Zasłony: CHALLANGER"]
[]
[null,"Sam karnisz"]
[null,"Szerokość   [cm]",40,50,60,70,80,90,100,110,120,130,140,150,160,170,180,190,200,210,220,230,240,250,260]
[null,"KARNISZ",57,60,63,78,81,84,88,91,106,109,112,115,119,134,137,140,143,146,162,165,168,171,196]
[null,"Włókno szklane 4mm",{"v":0.4,"d":"0.40"},{"v":0.5,"d":"0.50"},{"v":0.6,"d":"0.60"},{"v":0.7,"d":"0.70"},{"v":0.8,"d":"0.80"},{"v":0.9,"d":"0.90"},{"v":1,"d":"1.00"},{"v":1.1,"d":"1.10"},{"v":1.2,"d":"1.20"},{"v":1.3,"d":"1.30"},{"v":1.4,"d":"1.40"},{"v":1.5,"d":"1.50"},{"v":1.6,"d":"1.60"},{"v":1.7,"d":"1.70"},{"v":1.8,"d":"1.80"},{"v":1.9,"d":"1.90"},{"v":2,"d":"2.00"},{"v":2.1,"d":"2.10"},{"v":2.2,"d":"2.20"},{"v":2.3,"d":"2.30"},{"v":2.4,"d":"2.40"},{"v":2.5,"d":"2.50"},{"v":2.6,"d":"2.60"},{"v":2.7,"d":"2.70"},{"v":2.8,"d":"2.80"},{"v":2.9,"d":"2.90"},{"v":3,"d":"3.00"}]
[null,"RIBS",{"v":1.7868011200000002,"d":"1.79"},{"v":2.2335014,"d":"2.23"},{"v":2.68020168,"d":"2.68"},{"v":3.12690196,"d":"3.13"},{"v":3.5736022400000005,"d":"3.57"},{"v":4.02030252,"d":"4.02"},{"v":4.4670028,"d":"4.47"},{"v":4.913703080000001,"d":"4.91"},{"v":5.36040336,"d":"5.36"},{"v":5.807103640000001,"d":"5.81"},{"v":6.25380392,"d":"6.25"},{"v":6.700504200000001,"d":"6.70"},{"v":7.147204480000001,"d":"7.15"},{"v":7.59390476,"d":"7.59"},{"v":8.04060504,"d":"8.04"},{"v":8.48730532,"d":"8.49"},{"v":8.9340056,"d":"8.93"},{"v":9.38070588,"d":"9.38"},{"v":9.827406160000002,"d":"9.83"},{"v":10.27410644,"d":"10.27"},{"v":10.72080672,"d":"10.72"},{"v":11.167507,"d":"11.17"},{"v":11.614207280000002,"d":"11.61"},{"v":12.060907560000002,"d":"12.06"},{"v":12.50760784,"d":"12.51"},{"v":12.95430812,"d":"12.95"},{"v":13.401008400000002,"d":"13.40"}]
[null,"RIBS Biały",{"v":1.7868011200000002,"d":"1.79"},{"v":2.2335014,"d":"2.23"},{"v":2.68020168,"d":"2.68"},{"v":3.12690196,"d":"3.13"},{"v":3.5736022400000005,"d":"3.57"},{"v":4.02030252,"d":"4.02"},{"v":4.4670028,"d":"4.47"},{"v":4.913703080000001,"d":"4.91"},{"v":5.36040336,"d":"5.36"},{"v":5.807103640000001,"d":"5.81"},{"v":6.25380392,"d":"6.25"},{"v":6.700504200000001,"d":"6.70"},{"v":7.147204480000001,"d":"7.15"},{"v":7.59390476,"d":"7.59"},{"v":8.04060504,"d":"8.04"},{"v":8.48730532,"d":"8.49"},{"v":8.9340056,"d":"8.93"},{"v":9.38070588,"d":"9.38"},{"v":9.827406160000002,"d":"9.83"},{"v":10.27410644,"d":"10.27"},{"v":10.72080672,"d":"10.72"},{"v":11.167507,"d":"11.17"},{"v":11.614207280000002,"d":"11.61"},{"v":12.060907560000002,"d":"12.06"},{"v":12.50760784,"d":"12.51"},{"v":12.95430812,"d":"12.95"},{"v":13.401008400000002,"d":"13.40"}]
[null,"RIBS Brąz",{"v":1.7868011200000002,"d":"1.79"},{"v":2.2335014,"d":"2.23"},{"v":2.68020168,"d":"2.68"},{"v":3.12690196,"d":"3.13"},{"v":3.5736022400000005,"d":"3.57"},{"v":4.02030252,"d":"4.02"},{"v":4.4670028,"d":"4.47"},{"v":4.913703080000001,"d":"4.91"},{"v":5.36040336,"d":"5.36"},{"v":5.807103640000001,"d":"5.81"},{"v":6.25380392,"d":"6.25"},{"v":6.700504200000001,"d":"6.70"},{"v":7.147204480000001,"d":"7.15"},{"v":7.59390476,"d":"7.59"},{"v":8.04060504,"d":"8.04"},{"v":8.48730532,"d":"8.49"},{"v":8.9340056,"d":"8.93"},{"v":9.38070588,"d":"9.38"},{"v":9.827406160000002,"d":"9.83"},{"v":10.27410644,"d":"10.27"},{"v":10.72080672,"d":"10.72"},{"v":11.167507,"d":"11.17"},{"v":11.614207280000002,"d":"11.61"},{"v":12.060907560000002,"d":"12.06"},{"v":12.50760784,"d":"12.51"},{"v":12.95430812,"d":"12.95"},{"v":13.401008400000002,"d":"13.40"}]
[null,"RIBS Srebrny anoda",{"v":1.7868011200000002,"d":"1.79"},{"v":2.2335014,"d":"2.23"},{"v":2.68020168,"d":"2.68"},{"v":3.12690196,"d":"3.13"},{"v":3.5736022400000005,"d":"3.57"},{"v":4.02030252,"d":"4.02"},{"v":4.4670028,"d":"4.47"},{"v":4.913703080000001,"d":"4.91"},{"v":5.36040336,"d":"5.36"},{"v":5.807103640000001,"d":"5.81"},{"v":6.25380392,"d":"6.25"},{"v":6.700504200000001,"d":"6.70"},{"v":7.147204480000001,"d":"7.15"},{"v":7.59390476,"d":"7.59"},{"v":8.04060504,"d":"8.04"},{"v":8.48730532,"d":"8.49"},{"v":8.9340056,"d":"8.93"},{"v":9.38070588,"d":"9.38"},{"v":9.827406160000002,"d":"9.83"},{"v":10.27410644,"d":"10.27"},{"v":10.72080672,"d":"10.72"},{"v":11.167507,"d":"11.17"},{"v":11.614207280000002,"d":"11.61"},{"v":12.060907560000002,"d":"12.06"},{"v":12.50760784,"d":"12.51"},{"v":12.95430812,"d":"12.95"},{"v":13.401008400000002,"d":"13.40"}]
[null,"RIBS Szampański anoda",{"v":1.7868011200000002,"d":"1.79"},{"v":2.2335014,"d":"2.23"},{"v":2.68020168,"d":"2.68"},{"v":3.12690196,"d":"3.13"},{"v":3.5736022400000005,"d":"3.57"},{"v":4.02030252,"d":"4.02"},{"v":4.4670028,"d":"4.47"},{"v":4.913703080000001,"d":"4.91"},{"v":5.36040336,"d":"5.36"},{"v":5.807103640000001,"d":"5.81"},{"v":6.25380392,"d":"6.25"},{"v":6.700504200000001,"d":"6.70"},{"v":7.147204480000001,"d":"7.15"},{"v":7.59390476,"d":"7.59"},{"v":8.04060504,"d":"8.04"},{"v":8.48730532,"d":"8.49"},{"v":8.9340056,"d":"8.93"},{"v":9.38070588,"d":"9.38"},{"v":9.827406160000002,"d":"9.83"},{"v":10.27410644,"d":"10.27"},{"v":10.72080672,"d":"10.72"},{"v":11.167507,"d":"11.17"},{"v":11.614207280000002,"d":"11.61"},{"v":12.060907560000002,"d":"12.06"},{"v":12.50760784,"d":"12.51"},{"v":12.95430812,"d":"12.95"},{"v":13.401008400000002,"d":"13.40"}]
[null,"RIBS Szary anoda",{"v":1.7868011200000002,"d":"1.79"},{"v":2.2335014,"d":"2.23"},{"v":2.68020168,"d":"2.68"},{"v":3.12690196,"d":"3.13"},{"v":3.5736022400000005,"d":"3.57"},{"v":4.02030252,"d":"4.02"},{"v":4.4670028,"d":"4.47"},{"v":4.913703080000001,"d":"4.91"},{"v":5.36040336,"d":"5.36"},{"v":5.807103640000001,"d":"5.81"},{"v":6.25380392,"d":"6.25"},{"v":6.700504200000001,"d":"6.70"},{"v":7.147204480000001,"d":"7.15"},{"v":7.59390476,"d":"7.59"},{"v":8.04060504,"d":"8.04"},{"v":8.48730532,"d":"8.49"},{"v":8.9340056,"d":"8.93"},{"v":9.38070588,"d":"9.38"},{"v":9.827406160000002,"d":"9.83"},{"v":10.27410644,"d":"10.27"},{"v":10.72080672,"d":"10.72"},{"v":11.167507,"d":"11.17"},{"v":11.614207280000002,"d":"11.61"},{"v":12.060907560000002,"d":"12.06"},{"v":12.50760784,"d":"12.51"},{"v":12.95430812,"d":"12.95"},{"v":13.401008400000002,"d":"13.40"}]
[null,"RIBS Czarny anoda",{"v":1.7868011200000002,"d":"1.79"},{"v":2.2335014,"d":"2.23"},{"v":2.68020168,"d":"2.68"},{"v":3.12690196,"d":"3.13"},{"v":3.5736022400000005,"d":"3.57"},{"v":4.02030252,"d":"4.02"},{"v":4.4670028,"d":"4.47"},{"v":4.913703080000001,"d":"4.91"},{"v":5.36040336,"d":"5.36"},{"v":5.807103640000001,"d":"5.81"},{"v":6.25380392,"d":"6.25"},{"v":6.700504200000001,"d":"6.70"},{"v":7.147204480000001,"d":"7.15"},{"v":7.59390476,"d":"7.59"},{"v":8.04060504,"d":"8.04"},{"v":8.48730532,"d":"8.49"},{"v":8.9340056,"d":"8.93"},{"v":9.38070588,"d":"9.38"},{"v":9.827406160000002,"d":"9.83"},{"v":10.27410644,"d":"10.27"},{"v":10.72080672,"d":"10.72"},{"v":11.167507,"d":"11.17"},{"v":11.614207280000002,"d":"11.61"},{"v":12.060907560000002,"d":"12.06"},{"v":12.50760784,"d":"12.51"},{"v":12.95430812,"d":"12.95"},{"v":13.401008400000002,"d":"13.40"}]
[null,"Aluminiuowy 3x20",3.16,3.95,4.74,5.53,6.32,7.11,{"v":7.9,"d":"7.90"},{"v":8.690000000000001,"d":"8.69"},9.48,{"v":10.270000000000001,"d":"10.27"},11.06,{"v":11.850000000000001,"d":"11.85"},12.64,13.43,14.22,15.01,{"v":15.8,"d":"15.80"},16.59,{"v":17.380000000000003,"d":"17.38"},{"v":18.169999999999998,"d":"18.17"},18.96,19.75,{"v":20.540000000000003,"d":"20.54"},{"v":21.330000000000002,"d":"21.33"},22.12,22.91,{"v":23.700000000000003,"d":"23.70"}]
[null,"PS 5x20",{"v":0.8800000000000001,"d":"0.88"},{"v":1.1,"d":"1.10"},1.32,1.54,{"v":1.7600000000000002,"d":"1.76"},{"v":1.9800000000000002,"d":"1.98"},{"v":2.2,"d":"2.20"},{"v":2.4200000000000004,"d":"2.42"},2.64,{"v":2.8600000000000003,"d":"2.86"},3.08,{"v":3.3000000000000003,"d":"3.30"},{"v":3.5200000000000005,"d":"3.52"},3.74,{"v":3.9600000000000004,"d":"3.96"},4.18,{"v":4.4,"d":"4.40"},{"v":4.620000000000001,"d":"4.62"},{"v":4.840000000000001,"d":"4.84"},5.06,5.28,{"v":5.5,"d":"5.50"},{"v":5.720000000000001,"d":"5.72"},{"v":5.940000000000001,"d":"5.94"},6.16,6.38,{"v":6.6000000000000005,"d":"6.60"}]
[]
[null,"ilość     sznurków",2,2,2,3,3,3,3,3,4,4,4,4,4,5,5,5,5,5,6,6,6,6,6,7,7,7,7]

{"sheet":"Potwierdzenie parametrów","index":8,"n_rows":489,"n_cols":6,"rows_kept":489,"merged":[[0,0,0,1],[1,0,1,1],[1,8,1,9],[2,0,3,1],[2,8,3,9],[4,0,4,1],[4,8,4,9],[5,0,7,0],[5,1,7,1],[5,8,7,8],[5,9,7,9],[11,0,12,0],[11,1,12,1],[11,8,12,8],[11,9,12,9],[13,0,13,1],[13,8,13,9],[20,0,21,0],[20,1,21,1],[30,0,31,0],[30,1,31,1],[30,3,31,3],[42,0,42,1],[42,10,42,11],[43,0,46,1],[43,8,46,9],[47,0,47,1],[48,0,49,1],[50,0,50,1],[51,0,53,0],[51,1,53,1],[57,0,58,0],[57,1,58,1],[59,0,59,1],[66,0,67,0],[66,1,67,1],[76,0,77,0],[76,1,77,1],[76,3,77,3],[88,0,88,1],[89,0,92,1],[93,0,93,1],[94,0,95,1],[96,0,96,1],[97,0,99,0],[97,1,99,1],[103,0,104,0],[103,1,104,1],[105,0,105,1],[112,0,113,0],[112,1,113,1],[122,0,123,0],[122,1,123,1],[122,3,123,3],[134,0,134,1],[135,0,138,1],[139,0,139,1],[140,0,141,1],[142,0,142,1],[143,0,145,0],[143,1,145,1],[149,0,150,0],[149,1,150,1],[151,0,151,1],[158,0,159,0],[158,1,159,1],[168,0,169,0],[168,1,169,1],[168,3,169,3],[180,0,180,1],[181,0,184,1],[185,0,185,1],[186,0,187,1],[188,0,188,1],[189,0,191,0],[189,1,191,1],[195,0,196,0],[195,1,196,1],[197,0,197,1],[204,0,205,0],[204,1,205,1],[214,0,215,0],[214,1,215,1],[214,3,215,3],[226,0,226,1],[227,0,230,1],[231,0,231,1],[232,0,233,1],[234,0,234,1],[235,0,237,0],[235,1,237,1],[241,0,242,0],[241,1,242,1],[243,0,243,1],[250,0,251,0],[250,1,251,1],[260,0,261,0],[260,1,261,1],[260,3,261,3],[272,0,272,1],[273,0,276,1],[277,0,277,1],[278,0,279,1],[280,0,280,1],[281,0,283,0],[281,1,283,1],[287,0,288,0],[287,1,288,1],[289,0,289,1],[296,0,297,0],[296,1,297,1],[306,0,307,0],[306,1,307,1],[306,3,307,3],[318,0,318,1],[319,0,322,1],[323,0,323,1],[324,0,325,1],[326,0,326,1],[327,0,329,0],[327,1,329,1],[333,0,334,0],[333,1,334,1],[335,0,335,1],[342,0,343,0],[342,1,343,1],[352,0,353,0],[352,1,353,1],[352,3,353,3],[364,0,364,1],[365,0,368,1],[369,0,369,1],[370,0,371,1],[372,0,372,1],[373,0,375,0],[373,1,375,1],[379,0,380,0],[379,1,380,1],[381,0,381,1],[388,0,389,0],[388,1,389,1],[398,0,399,0],[398,1,399,1],[398,3,399,3],[410,0,410,1],[411,0,414,1],[415,0,415,1],[416,0,417,1],[418,0,418,1],[419,0,421,0],[419,1,421,1],[425,0,426,0],[425,1,426,1],[427,0,427,1],[434,0,435,0],[434,1,435,1],[444,0,445,0],[444,1,445,1],[444,3,445,3],[456,0,456,1],[457,0,460,1],[461,0,461,1],[462,0,463,1],[464,0,464,1],[465,0,467,0],[465,1,467,1],[471,0,472,0],[471,1,472,1],[473,0,473,1],[474,0,475,0],[476,0,477,0],[478,0,479,0],[480,0,481,0],[482,0,483,0],[484,0,485,0],[486,0,487,0],[490,0,491,0],[490,1,491,1],[490,3,491,3],[502,0,502,1],[503,0,506,1]]}
[{"$nulls":3},{"$f":"'Zamówieni SUPER PRICE'!AT9","v":0}]
[{"$f":"IF(D1=0,\"\",'Zamówieni SUPER PRICE'!A1)","v":""},null,1,{"$f":"'Zamówieni SUPER PRICE'!AT10","v":0}]
[{"$f":"IF(D1=0,\"\",'Zamówieni SUPER PRICE'!A2)","v":""},null,null,{"$f":"'Zamówieni SUPER PRICE'!AT11","v":0}]
[{"$nulls":3},{"$f":"'Zamówieni SUPER PRICE'!AT12","v":0}]
[{"$f":"IF(D1=0,\"\",\"NUMER ZLECENIA\")","v":""},null,null,{"$f":"'Zamówieni SUPER PRICE'!AT13","v":0}]
[{"$f":"IF(D1=0,\"\",'Zamówieni SUPER PRICE'!AM2)","v":""},{"$f":"IF(D1=0,\"\",\"*\"&A6&\"*\")","v":""},null,{"$f":"'Zamówieni SUPER PRICE'!AT14","v":0}]
[{"$nulls":3},{"$f":"'Zamówieni SUPER PRICE'!AT15","v":0}]
[{"$nulls":3},{"$f":"'Zamówieni SUPER PRICE'!AT16","v":0}]
[{"$f":"IF(D1=0,\"\",'Zamówieni SUPER PRICE'!V1)","v":""},{"$f":"IF(D1=0,\"\",'Zamówieni SUPER PRICE'!AD1)","v":""},null,{"$f":"'Zamówieni SUPER PRICE'!AT17","v":0}]
[{"$f":"IF(D1=0,\"\",'Zamówieni SUPER PRICE'!V2)","v":""},{"$f":"IF(D1=0,\"\",'Zamówieni SUPER PRICE'!AD2)","v":""},null,{"$f":"'Zamówieni SUPER PRICE'!AT18","v":0}]
[{"$f":"IF(D1=0,\"\",\"NUMER ZLECENIA KLIENTA\")","v":""},{"$f":"IF(D1=0,\"\",'Zamówieni SUPER PRICE'!L2)","v":""},null,"JEŻELI(D10=0;\"\";"]
[{"$f":"IF(D1=0,\"\",MID('Zamówieni SUPER PRICE'!A7,1,16))","v":""},{"$f":"IF(D1=0,\"\",MID('Zamówieni SUPER PRICE'!A7,18,16))","v":""}]
[]
[{"$f":"IF(D1=0,\"\",\"Pozycja \"&'Zamówieni SUPER PRICE'!A9&\" z \"&'Zamówieni SUPER PRICE'!AZ19)","v":""},null,null,{"$f":"'Zamówieni SUPER PRICE'!AZ19","v":0}]
[{"$f":"IF(D1=0,\"\",\"ILOŚĆ SZTUK\")","v":""},{"$f":"IF(D1=0,\"\",'Zamówieni SUPER PRICE'!AT9)","v":""}]
[{"$f":"IF(D1=0,\"\",\"SZEROKOŚĆ\")","v":""},{"$f":"IF(D1=0,\"\",'Zamówieni SUPER PRICE'!B9)","v":""}]
[{"$f":"IF(D1=0,\"\",\"WYSOKOŚĆ\")","v":""},{"$f":"IF(D1=0,\"\",'Zamówieni SUPER PRICE'!D9)","v":""}]
[{"$f":"IF(D1=0,\"\",\"SZEROKOSĆ TKANINY\")","v":""},{"$f":"IF(D1=0,\"\",'Zamówieni SUPER PRICE'!F9)","v":""}]
[{"$f":"IF(D1=0,\"\",\"WYSOKOŚĆ MONTAŻU\")","v":""},{"$f":"IF(D1=0,\"\",IF('Zamówieni SUPER PRICE'!G9=\"\",\"-\",'Zamówieni SUPER PRICE'!G9))","v":""}]
[{"$f":"IF(D1=0,\"\",\"SYSTEM\")","v":""},{"$f":"IF(D1=0,\"\",'Zamówieni SUPER PRICE'!I9)","v":""}]
[{"$f":"IF(D1=0,\"\",\"MODEL\")","v":""},{"$f":"IF(D1=0,\"\",'Zamówieni SUPER PRICE'!L9)","v":""}]
[]
[{"$f":"IF(D1=0,\"\",\"TYP\")","v":""},{"$f":"IF(D1=0,\"\",'Zamówieni SUPER PRICE'!N9)","v":""}]
[{"$f":"IF(D1=0,\"\",\"RODZAJ STEROWANIA\")","v":""},{"$f":"IF(D1=0,\"\",'Zamówieni SUPER PRICE'!O9)","v":""}]
[{"$f":"IF(D1=0,\"\",\"PRZEŁOŻENIE MECHANIZMU\")","v":""},{"$f":"IF(D25=0,\"1:1\",D25)","v":""},null,{"$f":"IF(D1=0,\"\",'Zamówieni SUPER PRICE'!P9)","v":""}]
[{"$f":"IF(D1=0,\"\",\"KOLEKCJA TKANINY\")","v":""},{"$f":"IF(D1=0,\"\",'Zamówieni SUPER PRICE'!Q9)","v":""}]
[{"$f":"IF(D1=0,\"\",\"KOLOR TKANINY\")","v":""},{"$f":"IF(D1=0,\"\",'Zamówieni SUPER PRICE'!U9)","v":""}]
[{"$f":"IF(D1=0,\"\",\"KIERUNEK SZYCIA\")","v":""},{"$f":"IF(D1=0,\"\",'Zamówieni SUPER PRICE'!X9)","v":""}]
[{"$f":"IF(D1=0,\"\",\"MECHANIZM OBOK TKANINY\")","v":""},{"$f":"IF(D29=0,\"-\",D29)","v":""},null,{"$f":"IF(D1=0,\"\",'Zamówieni SUPER PRICE'!Y9)","v":""}]
[{"$f":"IF(D1=0,\"\",\"SZPROSY\")","v":""},{"$f":"IF(D30=0,\"brak szprosów\",D30)","v":""},null,{"$f":"IF(D1=0,\"\",'Zamówieni SUPER PRICE'!Z9)","v":""}]
[{"$f":"IF(D1=0,\"\",\"WYKOŃCZENIE TUNELI\")","v":""},{"$f":"IF(D31=0,\"a. tunele odkryte\",D31)","v":""},null,{"$f":"IF(D1=0,\"\",'Zamówieni SUPER PRICE'!AD9)","v":""}]
[]
[{"$f":"IF(D1=0,\"\",\"OBCIĄŻNIK DOLNY\")","v":""},{"$f":"IF(D33=0,\"PS 5x20\",D33)","v":""},null,{"$f":"IF(D1=0,\"\",'Zamówieni SUPER PRICE'!AH9)","v":""}]
[{"$f":"IF(D1=0,\"\",\"MOCOWANIE GÓRNE\")","v":""},{"$f":"IF(D34=0,\"brak\",D34)","v":""},null,{"$f":"IF(D1=0,\"\",'Zamówieni SUPER PRICE'!AJ9)","v":""}]
[{"$f":"IF(D1=0,\"\",\"CHILD SAFETY \")","v":""},{"$f":"IF(D35=0,\"-\",D35)","v":""},null,{"$f":"IF(D1=0,\"\",'Zamówieni SUPER PRICE'!AM9)","v":""}]
[{"$f":"IF(D1=0,\"\",\"INNY ŁAŃCUSZEK\")","v":""},"",null,{"$f":"IF(D1=0,\"\",'Zamówieni SUPER PRICE'!AN9)","v":""}]
[{"$f":"IF(D1=0,\"\",\"LAMBREKIN\")","v":""},"",null,{"$f":"IF(D1=0,\"\",'Zamówieni SUPER PRICE'!AO9)","v":""}]
[{"$f":"IF(D1=0,\"\",\"ŻAGIEL\")","v":""},"",null,{"$f":"IF(D1=0,\"\",'Zamówieni SUPER PRICE'!AP9)","v":""}]
[{"$f":"IF(D1=0,\"\",\"MAKIET PRZECIW BLEKNIĘCIU\")","v":""},"",null,{"$f":"IF(D1=0,\"\",'Zamówieni SUPER PRICE'!AQ9)","v":""}]
[{"$f":"IF(D1=0,\"\",\"OSTATNI SEGMET NIE PODPIĘTY\")","v":""},"",null,{"$f":"IF(D1=0,\"\",'Zamówieni SUPER PRICE'!AR9)","v":""}]
[{"$f":"IF(D1=0,\"\",\"PAKOWANIE INDYWIDUALNE\")","v":""},"",null,{"$f":"IF(D1=0,\"\",'Zamówieni SUPER PRICE'!AS9)","v":""}]
[{"$f":"IF(D1=0,\"\",\"CENA\")","v":""},{"$f":"IF(D1=0,\"\",'Zamówieni SUPER PRICE'!AV9)","v":""}]
[{"$f":"IF(D1=0,\"\",\"UWAGI\")","v":""}]
[{"$f":"IF(D1=0,\"\",'Zamówieni SUPER PRICE'!AH22&\" \"&'Zamówieni SUPER PRICE'!AH32)","v":""}]
[]
[]
[]
[{"$f":"IF(D2=0,\"\",'Zamówieni SUPER PRICE'!A1)","v":""},"=",2]
[{"$f":"IF(D2=0,\"\",'Zamówieni SUPER PRICE'!A2)","v":""},"="]
["=","="]
[{"$f":"IF(D2=0,\"\",\"NUMER ZLECENIA\")","v":""},"="]
[{"$f":"IF(D2=0,\"\",'Zamówieni SUPER PRICE'!AM2)","v":""},{"$f":"IF(D2=0,\"\",\"*\"&A52&\"*\")","v":""}]
["="]
["="]
[{"$f":"IF(D2=0,\"\",'Zamówieni SUPER PRICE'!V1)","v":""},{"$f":"IF(D2=0,\"\",'Zamówieni SUPER PRICE'!AD1)","v":""}]
[{"$f":"IF(D2=0,\"\",'Zamówieni SUPER PRICE'!V2)","v":""},{"$f":"IF(D2=0,\"\",'Zamówieni SUPER PRICE'!AD2)","v":""}]
[{"$f":"IF(D2=0,\"\",\"NUMER ZLECENIA KLIENTA\")","v":""},{"$f":"IF(D2=0,\"\",'Zamówieni SUPER PRICE'!L2)","v":""}]
[{"$f":"IF(D2=0,\"\",MID('Zamówieni SUPER PRICE'!A7,1,16))","v":""},{"$f":"IF(D2=0,\"\",MID('Zamówieni SUPER PRICE'!A7,18,16))","v":""}]
["=","="]
[{"$f":"IF(D2=0,\"\",\"Pozycja \" &'Zamówieni SUPER PRICE'!A10&\" z \"&'Zamówieni SUPER PRICE'!$AZ$19)","v":""},"="]
[{"$f":"IF(D2=0,\"\",\"ILOŚĆ SZTUK\")","v":""},{"$f":"IF(D2=0,\"\",'Zamówieni SUPER PRICE'!AT10)","v":""}]
[{"$f":"IF(D2=0,\"\",\"SZEROKOŚĆ\")","v":""},{"$f":"IF(D2=0,\"\",'Zamówieni SUPER PRICE'!B10)","v":""}]
[{"$f":"IF(D2=0,\"\",\"WYSOKOŚĆ\")","v":""},{"$f":"IF(D2=0,\"\",'Zamówieni SUPER PRICE'!D10)","v":""}]
[{"$f":"IF(D2=0,\"\",\"SZEROKOSĆ TKANINY\")","v":""},{"$f":"IF(D2=0,\"\",'Zamówieni SUPER PRICE'!F10)","v":""}]
[{"$f":"IF(D2=0,\"\",\"WYSOKOŚĆ MONTAŻU\")","v":""},{"$f":"IF(D2=0,\"\",IF('Zamówieni SUPER PRICE'!G10=\"\",\"-\",'Zamówieni SUPER PRICE'!G10))","v":""}]
[{"$f":"IF(D2=0,\"\",\"SYSTEM\")","v":""},{"$f":"IF(D2=0,\"\",'Zamówieni SUPER PRICE'!I10)","v":""}]
[{"$f":"IF(D2=0,\"\",\"MODEL\")","v":""},{"$f":"IF(D2=0,\"\",'Zamówieni SUPER PRICE'!L10)","v":""}]
[]
[{"$f":"IF(D2=0,\"\",\"TYP\")","v":""},{"$f":"IF(D2=0,\"\",'Zamówieni SUPER PRICE'!N10)","v":""}]
[{"$f":"IF(D2=0,\"\",\"RODZAJ STEROWANIA\")","v":""},{"$f":"IF(D2=0,\"\",'Zamówieni SUPER PRICE'!O10)","v":""}]
[{"$f":"IF(D2=0,\"\",\"PRZEŁOŻENIE MECHANIZMU\")","v":""},{"$f":"IF(D71=0,\"1:1\",D71)","v":""},null,{"$f":"IF(D2=0,\"\",'Zamówieni SUPER PRICE'!P10)","v":""}]
[{"$f":"IF(D2=0,\"\",\"KOLEKCJA TKANINY\")","v":""},{"$f":"IF(D2=0,\"\",'Zamówieni SUPER PRICE'!Q10)","v":""}]
[{"$f":"IF(D2=0,\"\",\"KOLOR TKANINY\")","v":""},{"$f":"IF(D2=0,\"\",'Zamówieni SUPER PRICE'!U10)","v":""}]
[{"$f":"IF(D2=0,\"\",\"KIERUNEK SZYCIA\")","v":""},{"$f":"IF(D2=0,\"\",'Zamówieni SUPER PRICE'!X10)","v":""}]
[{"$f":"IF(D2=0,\"\",\"MECHANIZM OBOK TKANINY\")","v":""},{"$f":"IF(D75=0,\"-\",D75)","v":""},null,{"$f":"IF(D2=0,\"\",'Zamówieni SUPER PRICE'!Y10)","v":""}]
[{"$f":"IF(D2=0,\"\",\"SZPROSY\")","v":""},{"$f":"IF(D76=0,\"brak szprosów\",D76)","v":""},null,{"$f":"IF(D2=0,\"\",'Zamówieni SUPER PRICE'!Z10)","v":""}]
[{"$f":"IF(D2=0,\"\",\"WYKOŃCZENIE TUNELI\")","v":""},{"$f":"IF(D77=0,\"a. tunele odkryte\",D77)","v":""},null,{"$f":"IF(D2=0,\"\",'Zamówieni SUPER PRICE'!AD10)","v":""}]
[]
[{"$f":"IF(D2=0,\"\",\"OBCIĄŻNIK DOLNY\")","v":""},{"$f":"IF(D79=0,\"PS 5x20\",D79)","v":""},null,{"$f":"IF(D2=0,\"\",'Zamówieni SUPER PRICE'!AH10)","v":""}]
[{"$f":"IF(D2=0,\"\",\"MOCOWANIE GÓRNE\")","v":""},{"$f":"IF(D80=0,\"brak\",D80)","v":""},null,{"$f":"IF(D2=0,\"\",'Zamówieni SUPER PRICE'!AJ10)","v":""}]
[{"$f":"IF(D2=0,\"\",\"CHILD SAFETY \")","v":""},{"$f":"IF(D81=0,\"-\",D81)","v":""},null,{"$f":"IF(D2=0,\"\",'Zamówieni SUPER PRICE'!AM10)","v":""}]
[{"$f":"IF(D2=0,\"\",\"INNY ŁAŃCUSZEK\")","v":""},"",null,{"$f":"IF(D2=0,\"\",'Zamówieni SUPER PRICE'!AN10)","v":""}]
[{"$f":"IF(D2=0,\"\",\"LAMBREKIN\")","v":""},"",null,{"$f":"IF(D2=0,\"\",'Zamówieni SUPER PRICE'!AO10)","v":""}]
[{"$f":"IF(D2=0,\"\",\"ŻAGIEL\")","v":""},"",null,{"$f":"IF(D2=0,\"\",'Zamówieni SUPER PRICE'!AP10)","v":""}]
[{"$f":"IF(D2=0,\"\",\"MAKIET PRZECIW BLEKNIĘCIU\")","v":""},"",null,{"$f":"IF(D2=0,\"\",'Zamówieni SUPER PRICE'!AQ10)","v":""}]
[{"$f":"IF(D2=0,\"\",\"OSTATNI SEGMET NIE PODPIĘTY\")","v":""},"",null,{"$f":"IF(D2=0,\"\",'Zamówieni SUPER PRICE'!AR10)","v":""}]
[{"$f":"IF(D2=0,\"\",\"PAKOWANIE INDYWIDUALNE\")","v":""},"",null,{"$f":"IF(D2=0,\"\",'Zamówieni SUPER PRICE'!AS10)","v":""}]
[{"$f":"IF(D2=0,\"\",\"CENA\")","v":""},{"$f":"IF(D2=0,\"\",'Zamówieni SUPER PRICE'!AV10)","v":""}]
[{"$f":"IF(D2=0,\"\",\"UWAGI\")","v":""}]
[{"$f":"IF(D2=0,\"\",'Zamówieni SUPER PRICE'!AH23&\" \"&'Zamówieni SUPER PRICE'!AH32)","v":""},"="]
["=","="]
["=","="]
["=","="]
[{"$f":"IF(D3=0,\"\",'Zamówieni SUPER PRICE'!A1)","v":""},"=",3]
[{"$f":"IF(D3=0,\"\",'Zamówieni SUPER PRICE'!A2)","v":""},"="]
["=","="]
[{"$f":"IF(D3=0,\"\",\"NUMER ZLECENIA\")","v":""},"="]
[{"$f":"IF(D3=0,\"\",'Zamówieni SUPER PRICE'!AM2)","v":""},{"$f":"IF(D3=0,\"\",\"*\"&A6&\"*\")","v":""}]
["=","="]
["=","="]
[{"$f":"IF(D3=0,\"\",'Zamówieni SUPER PRICE'!V1)","v":""},{"$f":"IF(D3=0,\"\",'Zamówieni SUPER PRICE'!AD1)","v":""}]
[{"$f":"IF(D3=0,\"\",'Zamówieni SUPER PRICE'!V2)","v":""},{"$f":"IF(D3=0,\"\",'Zamówieni SUPER PRICE'!AD2)","v":""}]
[{"$f":"IF(D3=0,\"\",\"NUMER ZLECENIA KLIENTA\")","v":""},{"$f":"IF(D3=0,\"\",'Zamówieni SUPER PRICE'!L2)","v":""}]
[{"$f":"IF(D3=0,\"\",MID('Zamówieni SUPER PRICE'!A7,1,16))","v":""},{"$f":"IF(D3=0,\"\",MID('Zamówieni SUPER PRICE'!A7,18,16))","v":""}]
["=","="]
[{"$f":"IF(D3=0,\"\",\"Pozycja \"&'Zamówieni SUPER PRICE'!A11&\" z \"&'Zamówieni SUPER PRICE'!$AZ$19)","v":""},"="]
[{"$f":"IF(D3=0,\"\",\"ILOŚĆ SZTUK\")","v":""},{"$f":"IF(D3=0,\"\",'Zamówieni SUPER PRICE'!AT11)","v":""}]
[{"$f":"IF(D3=0,\"\",\"SZEROKOŚĆ\")","v":""},{"$f":"IF(D3=0,\"\",'Zamówieni SUPER PRICE'!B11)","v":""}]
[{"$f":"IF(D3=0,\"\",\"WYSOKOŚĆ\")","v":""},{"$f":"IF(D3=0,\"\",'Zamówieni SUPER PRICE'!D11)","v":""}]
[{"$f":"IF(D3=0,\"\",\"SZEROKOSĆ TKANINY\")","v":""},{"$f":"IF(D3=0,\"\",'Zamówieni SUPER PRICE'!F11)","v":""}]
[{"$f":"IF(D3=0,\"\",\"WYSOKOŚĆ MONTAŻU\")","v":""},{"$f":"IF(D3=0,\"\",IF('Zamówieni SUPER PRICE'!G11=\"\",\"-\",'Zamówieni SUPER PRICE'!G11))","v":""}]
[{"$f":"IF(D3=0,\"\",\"SYSTEM\")","v":""},{"$f":"IF(D3=0,\"\",'Zamówieni SUPER PRICE'!I11)","v":""}]
[{"$f":"IF(D3=0,\"\",\"MODEL\")","v":""},{"$f":"IF(D3=0,\"\",'Zamówieni SUPER PRICE'!L11)","v":""}]
["=","="]
[{"$f":"IF(D3=0,\"\",\"TYP\")","v":""},{"$f":"IF(D3=0,\"\",'Zamówieni SUPER PRICE'!N11)","v":""}]
[{"$f":"IF(D3=0,\"\",\"RODZAJ STEROWANIA\")","v":""},{"$f":"IF(D3=0,\"\",'Zamówieni SUPER PRICE'!O11)","v":""}]
[{"$f":"IF(D3=0,\"\",\"PRZEŁOŻENIE MECHANIZMU\")","v":""},{"$f":"IF(D117=0,\"1:1\",D117)","v":""},null,{"$f":"IF(D3=0,\"\",'Zamówieni SUPER PRICE'!P11)","v":""}]
[{"$f":"IF(D3=0,\"\",\"KOLEKCJA TKANINY\")","v":""},{"$f":"IF(D3=0,\"\",'Zamówieni SUPER PRICE'!Q11)","v":""}]
[{"$f":"IF(D3=0,\"\",\"KOLOR TKANINY\")","v":""},{"$f":"IF(D3=0,\"\",'Zamówieni SUPER PRICE'!U11)","v":""}]
[{"$f":"IF(D3=0,\"\",\"KIERUNEK SZYCIA\")","v":""},{"$f":"IF(D3=0,\"\",'Zamówieni SUPER PRICE'!X11)","v":""}]
[{"$f":"IF(D3=0,\"\",\"MECHANIZM OBOK TKANINY\")","v":""},{"$f":"IF(D121=0,\"-\",D121)","v":""},null,{"$f":"IF(D3=0,\"\",'Zamówieni SUPER PRICE'!Y11)","v":""}]
[{"$f":"IF(D3=0,\"\",\"SZPROSY\")","v":""},{"$f":"IF(D122=0,\"brak szprosów\",D122)","v":""},null,{"$f":"IF(D3=0,\"\",'Zamówieni SUPER PRICE'!Z11)","v":""}]
[{"$f":"IF(D3=0,\"\",\"WYKOŃCZENIE TUNELI\")","v":""},{"$f":"IF(D123=0,\"a. tunele odkryte\",D123)","v":""},null,{"$f":"IF(D3=0,\"\",'Zamówieni SUPER PRICE'!AD11)","v":""}]
["=",null,null,"=0"]
[{"$f":"IF(D3=0,\"\",\"OBCIĄŻNIK DOLNY\")","v":""},{"$f":"IF(D125=0,\"PS 5x20\",D125)","v":""},null,{"$f":"IF(D3=0,\"\",'Zamówieni SUPER PRICE'!AH11)","v":""}]
[{"$f":"IF(D3=0,\"\",\"MOCOWANIE GÓRNE\")","v":""},{"$f":"IF(D126=0,\"brak\",D126)","v":""},null,{"$f":"IF(D3=0,\"\",'Zamówieni SUPER PRICE'!AJ11)","v":""}]
[{"$f":"IF(D3=0,\"\",\"CHILD SAFETY \")","v":""},{"$f":"IF(D127=0,\"-\",D127)","v":""},null,{"$f":"IF(D3=0,\"\",'Zamówieni SUPER PRICE'!AM11)","v":""}]
[{"$f":"IF(D3=0,\"\",\"INNY ŁAŃCUSZEK\")","v":""},"",null,{"$f":"IF(D3=0,\"\",'Zamówieni SUPER PRICE'!AN11)","v":""}]
[{"$f":"IF(D3=0,\"\",\"LAMBREKIN\")","v":""},"",null,{"$f":"IF(D3=0,\"\",'Zamówieni SUPER PRICE'!AO11)","v":""}]
[{"$f":"IF(D3=0,\"\",\"ŻAGIEL\")","v":""},"",null,{"$f":"IF(D3=0,\"\",'Zamówieni SUPER PRICE'!AP11)","v":""}]
[{"$f":"IF(D3=0,\"\",\"MAKIET PRZECIW BLEKNIĘCIU\")","v":""},"",null,{"$f":"IF(D3=0,\"\",'Zamówieni SUPER PRICE'!AQ11)","v":""}]
[{"$f":"IF(D3=0,\"\",\"OSTATNI SEGMET NIE PODPIĘTY\")","v":""},"",null,{"$f":"IF(D3=0,\"\",'Zamówieni SUPER PRICE'!AR11)","v":""}]
[{"$f":"IF(D3=0,\"\",\"PAKOWANIE INDYWIDUALNE\")","v":""},"",null,{"$f":"IF(D3=0,\"\",'Zamówieni SUPER PRICE'!AS11)","v":""}]
[{"$f":"IF(D3=0,\"\",\"CENA\")","v":""},{"$f":"IF(D3=0,\"\",'Zamówieni SUPER PRICE'!AV11)","v":""}]
[{"$f":"IF(D3=0,\"\",\"UWAGI\")","v":""}]
[{"$f":"IF(D3=0,\"\",'Zamówieni SUPER PRICE'!AH24&\" \"&'Zamówieni SUPER PRICE'!AH32)","v":""},"="]
["=","="]
["=","="]
["=","="]
[{"$f":"IF(D4=0,\"\",'Zamówieni SUPER PRICE'!A1)","v":""},"="]
[{"$f":"IF(D4=0,\"\",'Zamówieni SUPER PRICE'!A2)","v":""},"="]
["=","="]
[{"$f":"IF(D4=0,\"\",\"NUMER ZLECENIA\")","v":""},"=",4]
[{"$f":"IF(D4=0,\"\",'Zamówieni SUPER PRICE'!AM2)","v":""},{"$f":"IF(D4=0,\"\",\"*\"&A6&\"*\")","v":""}]
["=","="]
["=","="]
[{"$f":"IF(D4=0,\"\",'Zamówieni SUPER PRICE'!V1)","v":""},{"$f":"IF(D4=0,\"\",'Zamówieni SUPER PRICE'!AD1)","v":""}]
[{"$f":"IF(D4=0,\"\",'Zamówieni SUPER PRICE'!V2)","v":""},{"$f":"IF(D4=0,\"\",'Zamówieni SUPER PRICE'!AD2)","v":""}]
[{"$f":"IF(D4=0,\"\",\"NUMER ZLECENIA KLIENTA\")","v":""},{"$f":"IF(D4=0,\"\",'Zamówieni SUPER PRICE'!L2)","v":""}]
[{"$f":"IF(D4=0,\"\",MID('Zamówieni SUPER PRICE'!A7,1,16))","v":""},{"$f":"IF(D4=0,\"\",MID('Zamówieni SUPER PRICE'!A7,18,16))","v":""}]
["=","="]
[{"$f":"IF(D4=0,\"\",\"Pozycja \"&'Zamówieni SUPER PRICE'!A12&\" z \" &'Zamówieni SUPER PRICE'!$AZ$19)","v":""},"="]
[{"$f":"IF(D4=0,\"\",\"ILOŚĆ SZTUK\")","v":""},{"$f":"IF(D4=0,\"\",'Zamówieni SUPER PRICE'!AT12)","v":""}]
[{"$f":"IF(D4=0,\"\",\"SZEROKOŚĆ\")","v":""},{"$f":"IF(D4=0,\"\",'Zamówieni SUPER PRICE'!B12)","v":""}]
[{"$f":"IF(D4=0,\"\",\"WYSOKOŚĆ\")","v":""},{"$f":"IF(D4=0,\"\",'Zamówieni SUPER PRICE'!D12)","v":""}]
[{"$f":"IF(D4=0,\"\",\"SZEROKOSĆ TKANINY\")","v":""},{"$f":"IF(D4=0,\"\",'Zamówieni SUPER PRICE'!F12)","v":""}]
[{"$f":"IF(D4=0,\"\",\"WYSOKOŚĆ MONTAŻU\")","v":""},{"$f":"IF(D4=0,\"\",IF('Zamówieni SUPER PRICE'!G12=\"\",\"-\",'Zamówieni SUPER PRICE'!G12))","v":""}]
[{"$f":"IF(D4=0,\"\",\"SYSTEM\")","v":""},{"$f":"IF(D4=0,\"\",'Zamówieni SUPER PRICE'!I12)","v":""}]
[{"$f":"IF(D4=0,\"\",\"MODEL\")","v":""},{"$f":"IF(D4=0,\"\",'Zamówieni SUPER PRICE'!L12)","v":""}]
["=","="]
[{"$f":"IF(D4=0,\"\",\"TYP\")","v":""},{"$f":"IF(D4=0,\"\",'Zamówieni SUPER PRICE'!N12)","v":""}]
[{"$f":"IF(D4=0,\"\",\"RODZAJ STEROWANIA\")","v":""},{"$f":"IF(D4=0,\"\",'Zamówieni SUPER PRICE'!O12)","v":""}]
[{"$f":"IF(D4=0,\"\",\"PRZEŁOŻENIE MECHANIZMU\")","v":""},{"$f":"IF(D163=0,\"1:1\",D163)","v":""},null,{"$f":"IF(D4=0,\"\",'Zamówieni SUPER PRICE'!P12)","v":""}]
[{"$f":"IF(D4=0,\"\",\"KOLEKCJA TKANINY\")","v":""},{"$f":"IF(D4=0,\"\",'Zamówieni SUPER PRICE'!Q12)","v":""}]
[{"$f":"IF(D4=0,\"\",\"KOLOR TKANINY\")","v":""},{"$f":"IF(D4=0,\"\",'Zamówieni SUPER PRICE'!U12)","v":""}]
[{"$f":"IF(D4=0,\"\",\"KIERUNEK SZYCIA\")","v":""},{"$f":"IF(D4=0,\"\",'Zamówieni SUPER PRICE'!X12)","v":""}]
[{"$f":"IF(D4=0,\"\",\"MECHANIZM OBOK TKANINY\")","v":""},{"$f":"IF(D167=0,\"-\",D167)","v":""},null,{"$f":"IF(D4=0,\"\",'Zamówieni SUPER PRICE'!Y12)","v":""}]
[{"$f":"IF(D4=0,\"\",\"SZPROSY\")","v":""},{"$f":"IF(D168=0,\"brak szprosów\",D168)","v":""},null,{"$f":"IF(D4=0,\"\",'Zamówieni SUPER PRICE'!Z12)","v":""}]
[{"$f":"IF(D4=0,\"\",\"WYKOŃCZENIE TUNELI\")","v":""},{"$f":"IF(D169=0,\"a. tunele odkryte\",D169)","v":""},null,{"$f":"IF(D4=0,\"\",'Zamówieni SUPER PRICE'!AD12)","v":""}]
["=",null,null,"=0"]
[{"$f":"IF(D4=0,\"\",\"OBCIĄŻNIK DOLNY\")","v":""},{"$f":"IF(D171=0,\"PS 5x20\",D171)","v":""},null,{"$f":"IF(D4=0,\"\",'Zamówieni SUPER PRICE'!AH12)","v":""}]
[{"$f":"IF(D4=0,\"\",\"MOCOWANIE GÓRNE\")","v":""},{"$f":"IF(D172=0,\"brak\",D172)","v":""},null,{"$f":"IF(D4=0,\"\",'Zamówieni SUPER PRICE'!AJ12)","v":""}]
[{"$f":"IF(D4=0,\"\",\"CHILD SAFETY \")","v":""},{"$f":"IF(D173=0,\"-\",D173)","v":""},null,{"$f":"IF(D4=0,\"\",'Zamówieni SUPER PRICE'!AM12)","v":""}]
[{"$f":"IF(D4=0,\"\",\"INNY ŁAŃCUSZEK\")","v":""},"",null,{"$f":"IF(D4=0,\"\",'Zamówieni SUPER PRICE'!AN12)","v":""}]
[{"$f":"IF(D4=0,\"\",\"LAMBREKIN\")","v":""},"",null,{"$f":"IF(D4=0,\"\",'Zamówieni SUPER PRICE'!AO12)","v":""}]
[{"$f":"IF(D4=0,\"\",\"ŻAGIEL\")","v":""},"",null,{"$f":"IF(D4=0,\"\",'Zamówieni SUPER PRICE'!AP12)","v":""}]
[{"$f":"IF(D4=0,\"\",\"MAKIET PRZECIW BLEKNIĘCIU\")","v":""},"",null,{"$f":"IF(D4=0,\"\",'Zamówieni SUPER PRICE'!AQ12)","v":""}]
[{"$f":"IF(D4=0,\"\",\"OSTATNI SEGMET NIE PODPIĘTY\")","v":""},"",null,{"$f":"IF(D4=0,\"\",'Zamówieni SUPER PRICE'!AR12)","v":""}]
[{"$f":"IF(D4=0,\"\",\"PAKOWANIE INDYWIDUALNE\")","v":""},"",null,{"$f":"IF(D4=0,\"\",'Zamówieni SUPER PRICE'!AS12)","v":""}]
[{"$f":"IF(D4=0,\"\",\"CENA\")","v":""},{"$f":"IF(D4=0,\"\",'Zamówieni SUPER PRICE'!AV12)","v":""}]
[{"$f":"IF(D4=0,\"\",\"UWAGI\")","v":""}]
[{"$f":"IF(D4=0,\"\",'Zamówieni SUPER PRICE'!AH25&\" \"&'Zamówieni SUPER PRICE'!AH32)","v":""},"="]
["=","="]
["=","="]
["=","="]
[{"$f":"IF(D5=0,\"\",'Zamówieni SUPER PRICE'!A1)","v":""},"=",5]
[{"$f":"IF(D5=0,\"\",'Zamówieni SUPER PRICE'!A2)","v":""},"="]
["=","="]
[{"$f":"IF(D5=0,\"\",\"NUMER ZLECENIA\")","v":""},"="]
[{"$f":"IF(D5=0,\"\",'Zamówieni SUPER PRICE'!AM2)","v":""},{"$f":"IF(D5=0,\"\",\"*\"&A6&\"*\")","v":""}]
["=","="]
["=","="]
[{"$f":"IF(D5=0,\"\",'Zamówieni SUPER PRICE'!V1)","v":""},{"$f":"IF(D5=0,\"\",'Zamówieni SUPER PRICE'!AD1)","v":""}]
[{"$f":"IF(D5=0,\"\",'Zamówieni SUPER PRICE'!V2)","v":""},{"$f":"IF(D5=0,\"\",'Zamówieni SUPER PRICE'!AD2)","v":""}]
[{"$f":"IF(D5=0,\"\",\"NUMER ZLECENIA KLIENTA\")","v":""},{"$f":"IF(D5=0,\"\",'Zamówieni SUPER PRICE'!L2)","v":""}]
[{"$f":"IF(D5=0,\"\",MID('Zamówieni SUPER PRICE'!A7,1,16))","v":""},{"$f":"IF(D5=0,\"\",MID('Zamówieni SUPER PRICE'!A7,18,16))","v":""}]
["=","="]
[{"$f":"IF(D5=0,\"\",\"Pozycja \"&'Zamówieni SUPER PRICE'!A13&\" z \" &'Zamówieni SUPER PRICE'!$AZ$19)","v":""},"="]
[{"$f":"IF(D5=0,\"\",\"ILOŚĆ SZTUK\")","v":""},{"$f":"IF(D5=0,\"\",'Zamówieni SUPER PRICE'!AT13)","v":""}]
[{"$f":"IF(D5=0,\"\",\"SZEROKOŚĆ\")","v":""}]
[{"$f":"IF(D5=0,\"\",\"WYSOKOŚĆ\")","v":""},{"$f":"IF(D5=0,\"\",'Zamówieni SUPER PRICE'!D13)","v":""}]
[{"$f":"IF(D5=0,\"\",\"SZEROKOSĆ TKANINY\")","v":""},{"$f":"IF(D5=0,\"\",'Zamówieni SUPER PRICE'!F13)","v":""}]
[{"$f":"IF(D5=0,\"\",\"WYSOKOŚĆ MONTAŻU\")","v":""},{"$f":"IF(D5=0,\"\",IF('Zamówieni SUPER PRICE'!G13=\"\",\"-\",'Zamówieni SUPER PRICE'!G13))","v":""}]
[{"$f":"IF(D5=0,\"\",\"SYSTEM\")","v":""},{"$f":"IF(D5=0,\"\",'Zamówieni SUPER PRICE'!I13)","v":""}]
[{"$f":"IF(D5=0,\"\",\"MODEL\")","v":""},{"$f":"IF(D5=0,\"\",'Zamówieni SUPER PRICE'!L13)","v":""}]
["=","="]
[{"$f":"IF(D5=0,\"\",\"TYP\")","v":""},{"$f":"IF(D5=0,\"\",'Zamówieni SUPER PRICE'!N13)","v":""}]
[{"$f":"IF(D5=0,\"\",\"RODZAJ STEROWANIA\")","v":""},{"$f":"IF(D5=0,\"\",'Zamówieni SUPER PRICE'!O13)","v":""}]
[{"$f":"IF(D5=0,\"\",\"PRZEŁOŻENIE MECHANIZMU\")","v":""},{"$f":"IF(D209=0,\"1:1\",D209)","v":""},null,{"$f":"IF(D5=0,\"\",'Zamówieni SUPER PRICE'!P13)","v":""}]
[{"$f":"IF(D5=0,\"\",\"KOLEKCJA TKANINY\")","v":""},{"$f":"IF(D5=0,\"\",'Zamówieni SUPER PRICE'!Q13)","v":""}]
[{"$f":"IF(D5=0,\"\",\"KOLOR TKANINY\")","v":""},{"$f":"IF(D5=0,\"\",'Zamówieni SUPER PRICE'!U13)","v":""}]
[{"$f":"IF(D5=0,\"\",\"KIERUNEK SZYCIA\")","v":""},{"$f":"IF(D5=0,\"\",'Zamówieni SUPER PRICE'!X13)","v":""}]
[{"$f":"IF(D5=0,\"\",\"MECHANIZM OBOK TKANINY\")","v":""},{"$f":"IF(D213=0,\"-\",D213)","v":""},null,{"$f":"IF(D5=0,\"\",'Zamówieni SUPER PRICE'!Y13)","v":""}]
[{"$f":"IF(D5=0,\"\",\"SZPROSY\")","v":""},{"$f":"IF(D214=0,\"brak szprosów\",D214)","v":""},null,{"$f":"IF(D5=0,\"\",'Zamówieni SUPER PRICE'!Z13)","v":""}]
[{"$f":"IF(D5=0,\"\",\"WYKOŃCZENIE TUNELI\")","v":""},{"$f":"IF(D215=0,\"a. tunele odkryte\",D215)","v":""},null,{"$f":"IF(D5=0,\"\",'Zamówieni SUPER PRICE'!AD13)","v":""}]
["=",null,null,"=0"]
[{"$f":"IF(D5=0,\"\",\"OBCIĄŻNIK DOLNY\")","v":""},{"$f":"IF(D217=0,\"PS 5x20\",D217)","v":""},null,{"$f":"IF(D5=0,\"\",'Zamówieni SUPER PRICE'!AH13)","v":""}]
[{"$f":"IF(D5=0,\"\",\"MOCOWANIE GÓRNE\")","v":""},{"$f":"IF(D218=0,\"brak\",D218)","v":""},null,{"$f":"IF(D5=0,\"\",'Zamówieni SUPER PRICE'!AJ12)","v":""}]
[{"$f":"IF(D5=0,\"\",\"CHILD SAFETY \")","v":""},{"$f":"IF(D219=0,\"-\",D219)","v":""},null,{"$f":"IF(D5=0,\"\",'Zamówieni SUPER PRICE'!AM12)","v":""}]
[{"$f":"IF(D5=0,\"\",\"INNY ŁAŃCUSZEK\")","v":""},"",null,{"$f":"IF(D5=0,\"\",'Zamówieni SUPER PRICE'!AN12)","v":""}]
[{"$f":"IF(D5=0,\"\",\"LAMBREKIN\")","v":""},"",null,{"$f":"IF(D5=0,\"\",'Zamówieni SUPER PRICE'!AO12)","v":""}]
[{"$f":"IF(D5=0,\"\",\"ŻAGIEL\")","v":""},"",null,{"$f":"IF(D5=0,\"\",'Zamówieni SUPER PRICE'!AP12)","v":""}]
[{"$f":"IF(D5=0,\"\",\"MAKIET PRZECIW BLEKNIĘCIU\")","v":""},"",null,{"$f":"IF(D5=0,\"\",'Zamówieni SUPER PRICE'!AQ12)","v":""}]
[{"$f":"IF(D5=0,\"\",\"OSTATNI SEGMET NIE PODPIĘTY\")","v":""},"",null,{"$f":"IF(D5=0,\"\",'Zamówieni SUPER PRICE'!AR12)","v":""}]
[{"$f":"IF(D5=0,\"\",\"PAKOWANIE INDYWIDUALNE\")","v":""},"",null,{"$f":"IF(D5=0,\"\",'Zamówieni SUPER PRICE'!AS12)","v":""}]
[{"$f":"IF(D5=0,\"\",\"CENA\")","v":""},{"$f":"IF(D5=0,\"\",'Zamówieni SUPER PRICE'!AV12)","v":""}]
[{"$f":"IF(D5=0,\"\",\"UWAGI\")","v":""}]
[{"$f":"IF(D5=0,\"\",'Zamówieni SUPER PRICE'!AH26&\" \"&'Zamówieni SUPER PRICE'!AH32)","v":""},"="]
["=","="]
["=","="]
["=","="]
[{"$f":"IF(D6=0,\"\",'Zamówieni SUPER PRICE'!A1)","v":""},"=",6]
[{"$f":"IF(D6=0,\"\",'Zamówieni SUPER PRICE'!A2)","v":""},"="]
["=","="]
[{"$f":"IF(D6=0,\"\",\"NUMER ZLECENIA\")","v":""},"="]
[{"$f":"IF(D6=0,\"\",'Zamówieni SUPER PRICE'!AM2)","v":""},{"$f":"IF(D6=0,\"\",\"*\"&A6&\"*\")","v":""}]
["=","="]
["=","="]
[{"$f":"IF(D6=0,\"\",'Zamówieni SUPER PRICE'!V1)","v":""},{"$f":"IF(D6=0,\"\",'Zamówieni SUPER PRICE'!AD1)","v":""}]
[{"$f":"IF(D6=0,\"\",'Zamówieni SUPER PRICE'!V2)","v":""},{"$f":"IF(D6=0,\"\",'Zamówieni SUPER PRICE'!AD2)","v":""}]
[{"$f":"IF(D6=0,\"\",\"NUMER ZLECENIA KLIENTA\")","v":""},{"$f":"IF(D6=0,\"\",'Zamówieni SUPER PRICE'!L2)","v":""}]
[{"$f":"IF(D6=0,\"\",MID('Zamówieni SUPER PRICE'!A7,1,16))","v":""},{"$f":"IF(D6=0,\"\",MID('Zamówieni SUPER PRICE'!A7,18,16))","v":""}]
["=","="]
[{"$f":"IF(D6=0,\"\",\"Pozycja \"&'Zamówieni SUPER PRICE'!A14&\" z \" &'Zamówieni SUPER PRICE'!$AZ$19)","v":""},"="]
[{"$f":"IF(D6=0,\"\",\"ILOŚĆ SZTUK\")","v":""},{"$f":"IF(D6=0,\"\",'Zamówieni SUPER PRICE'!AT14)","v":""}]
[{"$f":"IF(D6=0,\"\",\"SZEROKOŚĆ\")","v":""},{"$f":"IF(D6=0,\"\",'Zamówieni SUPER PRICE'!B14)","v":""}]
[{"$f":"IF(D6=0,\"\",\"WYSOKOŚĆ\")","v":""},{"$f":"IF(D6=0,\"\",'Zamówieni SUPER PRICE'!D14)","v":""}]
[{"$f":"IF(D6=0,\"\",\"SZEROKOSĆ TKANINY\")","v":""},{"$f":"IF(D6=0,\"\",'Zamówieni SUPER PRICE'!F14)","v":""}]
[{"$f":"IF(D6=0,\"\",\"WYSOKOŚĆ MONTAŻU\")","v":""},{"$f":"IF(D6=0,\"\",IF('Zamówieni SUPER PRICE'!G14=\"\",\"-\",'Zamówieni SUPER PRICE'!G14))","v":""}]
[{"$f":"IF(D6=0,\"\",\"SYSTEM\")","v":""},{"$f":"IF(D6=0,\"\",'Zamówieni SUPER PRICE'!I14)","v":""}]
[{"$f":"IF(D6=0,\"\",\"MODEL\")","v":""},{"$f":"IF(D6=0,\"\",'Zamówieni SUPER PRICE'!L14)","v":""}]
["=","="]
[{"$f":"IF(D6=0,\"\",\"TYP\")","v":""},{"$f":"IF(D6=0,\"\",'Zamówieni SUPER PRICE'!N14)","v":""}]
[{"$f":"IF(D6=0,\"\",\"RODZAJ STEROWANIA\")","v":""},{"$f":"IF(D6=0,\"\",'Zamówieni SUPER PRICE'!O14)","v":""}]
[{"$f":"IF(D6=0,\"\",\"PRZEŁOŻENIE MECHANIZMU\")","v":""},{"$f":"IF(D255=0,\"1:1\",D255)","v":""},null,{"$f":"IF(D6=0,\"\",'Zamówieni SUPER PRICE'!P14)","v":""}]
[{"$f":"IF(D6=0,\"\",\"KOLEKCJA TKANINY\")","v":""},{"$f":"IF(D6=0,\"\",'Zamówieni SUPER PRICE'!Q14)","v":""}]
[{"$f":"IF(D6=0,\"\",\"KOLOR TKANINY\")","v":""},{"$f":"IF(D6=0,\"\",'Zamówieni SUPER PRICE'!U14)","v":""}]
[{"$f":"IF(D6=0,\"\",\"KIERUNEK SZYCIA\")","v":""},{"$f":"IF(D6=0,\"\",'Zamówieni SUPER PRICE'!X14)","v":""}]
[{"$f":"IF(D6=0,\"\",\"MECHANIZM OBOK TKANINY\")","v":""},{"$f":"IF(D259=0,\"-\",D259)","v":""},null,{"$f":"IF(D6=0,\"\",'Zamówieni SUPER PRICE'!Y14)","v":""}]
[{"$f":"IF(D6=0,\"\",\"SZPROSY\")","v":""},{"$f":"IF(D260=0,\"brak szprosów\",D260)","v":""},null,{"$f":"IF(D6=0,\"\",'Zamówieni SUPER PRICE'!Z14)","v":""}]
[{"$f":"IF(D6=0,\"\",\"WYKOŃCZENIE TUNELI\")","v":""},{"$f":"IF(D261=0,\"a. tunele odkryte\",D261)","v":""},null,{"$f":"IF(D6=0,\"\",'Zamówieni SUPER PRICE'!AD14)","v":""}]
["=",null,null,"=0"]
[{"$f":"IF(D6=0,\"\",\"OBCIĄŻNIK DOLNY\")","v":""},{"$f":"IF(D263=0,\"PS 5x20\",D263)","v":""},null,{"$f":"IF(D6=0,\"\",'Zamówieni SUPER PRICE'!AH14)","v":""}]
[{"$f":"IF(D6=0,\"\",\"MOCOWANIE GÓRNE\")","v":""},{"$f":"IF(D264=0,\"brak\",D264)","v":""},null,{"$f":"IF(D6=0,\"\",'Zamówieni SUPER PRICE'!AJ14)","v":""}]
[{"$f":"IF(D6=0,\"\",\"CHILD SAFETY \")","v":""},{"$f":"IF(D265=0,\"-\",D265)","v":""},null,{"$f":"IF(D6=0,\"\",'Zamówieni SUPER PRICE'!AM14)","v":""}]
[{"$f":"IF(D6=0,\"\",\"INNY ŁAŃCUSZEK\")","v":""},"",null,{"$f":"IF(D6=0,\"\",'Zamówieni SUPER PRICE'!AN14)","v":""}]
[{"$f":"IF(D6=0,\"\",\"LAMBREKIN\")","v":""},"",null,{"$f":"IF(D6=0,\"\",'Zamówieni SUPER PRICE'!AO14)","v":""}]
[{"$f":"IF(D6=0,\"\",\"ŻAGIEL\")","v":""},"",null,{"$f":"IF(D6=0,\"\",'Zamówieni SUPER PRICE'!AP14)","v":""}]
[{"$f":"IF(D6=0,\"\",\"MAKIET PRZECIW BLEKNIĘCIU\")","v":""},"",null,{"$f":"IF(D6=0,\"\",'Zamówieni SUPER PRICE'!AQ14)","v":""}]
[{"$f":"IF(D6=0,\"\",\"OSTATNI SEGMET NIE PODPIĘTY\")","v":""},"",null,{"$f":"IF(D6=0,\"\",'Zamówieni SUPER PRICE'!AR14)","v":""}]
[{"$f":"IF(D6=0,\"\",\"PAKOWANIE INDYWIDUALNE\")","v":""},"",null,{"$f":"IF(D6=0,\"\",'Zamówieni SUPER PRICE'!AS14)","v":""}]
[{"$f":"IF(D6=0,\"\",\"CENA\")","v":""},{"$f":"IF(D6=0,\"\",'Zamówieni SUPER PRICE'!AV14)","v":""}]
[{"$f":"IF(D6=0,\"\",\"UWAGI\")","v":""}]
[{"$f":"IF(D6=0,\"\",'Zamówieni SUPER PRICE'!AH27&\" \"&'Zamówieni SUPER PRICE'!AH32)","v":""},"="]
["=","="]
["=","="]
["=","="]
[{"$f":"IF(D7=0,\"\",'Zamówieni SUPER PRICE'!A1)","v":""},"=",7]
[{"$f":"IF(D7=0,\"\",'Zamówieni SUPER PRICE'!A2)","v":""},"="]
["=","="]
[{"$f":"IF(D7=0,\"\",\"NUMER ZLECENIA\")","v":""},"="]
[{"$f":"IF(D7=0,\"\",'Zamówieni SUPER PRICE'!AM2)","v":""},{"$f":"IF(D7=0,\"\",\"*\"&A6&\"*\")","v":""}]
["=","="]
["=","="]
[{"$f":"IF(D7=0,\"\",'Zamówieni SUPER PRICE'!V1)","v":""},{"$f":"IF(D7=0,\"\",'Zamówieni SUPER PRICE'!AD1)","v":""}]
[{"$f":"IF(D7=0,\"\",'Zamówieni SUPER PRICE'!V2)","v":""},{"$f":"IF(D7=0,\"\",'Zamówieni SUPER PRICE'!AD2)","v":""}]
[{"$f":"IF(D7=0,\"\",\"NUMER ZLECENIA KLIENTA\")","v":""},{"$f":"IF(D7=0,\"\",'Zamówieni SUPER PRICE'!L2)","v":""}]
[{"$f":"IF(D7=0,\"\",MID('Zamówieni SUPER PRICE'!A7,1,16))","v":""},{"$f":"IF(D7=0,\"\",MID('Zamówieni SUPER PRICE'!A7,18,16))","v":""}]
["=","="]
[{"$f":"IF(D7=0,\"\",\"Pozycja \"&'Zamówieni SUPER PRICE'!A15&\" z \" &'Zamówieni SUPER PRICE'!$AZ$19)","v":""},"="]
[{"$f":"IF(D7=0,\"\",\"ILOŚĆ SZTUK\")","v":""},{"$f":"IF(D7=0,\"\",'Zamówieni SUPER PRICE'!AT15)","v":""}]
[{"$f":"IF(D7=0,\"\",\"SZEROKOŚĆ\")","v":""},{"$f":"IF(D7=0,\"\",'Zamówieni SUPER PRICE'!B15)","v":""}]
[{"$f":"IF(D7=0,\"\",\"WYSOKOŚĆ\")","v":""},{"$f":"IF(D7=0,\"\",'Zamówieni SUPER PRICE'!D15)","v":""}]
[{"$f":"IF(D7=0,\"\",\"SZEROKOSĆ TKANINY\")","v":""},{"$f":"IF(D7=0,\"\",'Zamówieni SUPER PRICE'!F15)","v":""}]
[{"$f":"IF(D7=0,\"\",\"WYSOKOŚĆ MONTAŻU\")","v":""},{"$f":"IF(D7=0,\"\",IF('Zamówieni SUPER PRICE'!G15=\"\",\"-\",'Zamówieni SUPER PRICE'!G15))","v":""}]
[{"$f":"IF(D7=0,\"\",\"SYSTEM\")","v":""},{"$f":"IF(D7=0,\"\",'Zamówieni SUPER PRICE'!I15)","v":""}]
[{"$f":"IF(D7=0,\"\",\"MODEL\")","v":""},{"$f":"IF(D7=0,\"\",'Zamówieni SUPER PRICE'!L15)","v":""}]
["=","="]
[{"$f":"IF(D7=0,\"\",\"TYP\")","v":""},{"$f":"IF(D7=0,\"\",'Zamówieni SUPER PRICE'!N15)","v":""}]
[{"$f":"IF(D7=0,\"\",\"RODZAJ STEROWANIA\")","v":""},{"$f":"IF(D7=0,\"\",'Zamówieni SUPER PRICE'!O15)","v":""}]
[{"$f":"IF(D7=0,\"\",\"PRZEŁOŻENIE MECHANIZMU\")","v":""},{"$f":"IF(D301=0,\"1:1\",D301)","v":""},null,{"$f":"IF(D7=0,\"\",'Zamówieni SUPER PRICE'!P15)","v":""}]
[{"$f":"IF(D7=0,\"\",\"KOLEKCJA TKANINY\")","v":""},{"$f":"IF(D7=0,\"\",'Zamówieni SUPER PRICE'!Q15)","v":""}]
[{"$f":"IF(D7=0,\"\",\"KOLOR TKANINY\")","v":""},{"$f":"IF(D7=0,\"\",'Zamówieni SUPER PRICE'!U15)","v":""}]
[{"$f":"IF(D7=0,\"\",\"KIERUNEK SZYCIA\")","v":""},{"$f":"IF(D7=0,\"\",'Zamówieni SUPER PRICE'!X15)","v":""}]
[{"$f":"IF(D7=0,\"\",\"MECHANIZM OBOK TKANINY\")","v":""},{"$f":"IF(D305=0,\"-\",D305)","v":""},null,{"$f":"IF(D7=0,\"\",'Zamówieni SUPER PRICE'!Y15)","v":""}]
[{"$f":"IF(D7=0,\"\",\"SZPROSY\")","v":""},{"$f":"IF(D306=0,\"brak szprosów\",D306)","v":""},null,{"$f":"IF(D7=0,\"\",'Zamówieni SUPER PRICE'!Z15)","v":""}]
[{"$f":"IF(D7=0,\"\",\"WYKOŃCZENIE TUNELI\")","v":""},{"$f":"IF(D307=0,\"a. tunele odkryte\",D307)","v":""},null,{"$f":"IF(D7=0,\"\",'Zamówieni SUPER PRICE'!AD15)","v":""}]
["=",null,null,"=0"]
[{"$f":"IF(D7=0,\"\",\"OBCIĄŻNIK DOLNY\")","v":""},{"$f":"IF(D309=0,\"PS 5x20\",D309)","v":""},null,{"$f":"IF(D7=0,\"\",'Zamówieni SUPER PRICE'!AH15)","v":""}]
[{"$f":"IF(D7=0,\"\",\"MOCOWANIE GÓRNE\")","v":""},{"$f":"IF(D310=0,\"brak\",D310)","v":""},null,{"$f":"IF(D7=0,\"\",'Zamówieni SUPER PRICE'!AJ15)","v":""}]
[{"$f":"IF(D7=0,\"\",\"CHILD SAFETY \")","v":""},{"$f":"IF(D311=0,\"-\",D311)","v":""},null,{"$f":"IF(D7=0,\"\",'Zamówieni SUPER PRICE'!AM15)","v":""}]
[{"$f":"IF(D7=0,\"\",\"INNY ŁAŃCUSZEK\")","v":""},"",null,{"$f":"IF(D7=0,\"\",'Zamówieni SUPER PRICE'!AN15)","v":""}]
[{"$f":"IF(D7=0,\"\",\"LAMBREKIN\")","v":""},"",null,{"$f":"IF(D7=0,\"\",'Zamówieni SUPER PRICE'!AO15)","v":""}]
[{"$f":"IF(D7=0,\"\",\"ŻAGIEL\")","v":""},"",null,{"$f":"IF(D7=0,\"\",'Zamówieni SUPER PRICE'!AP15)","v":""}]
[{"$f":"IF(D7=0,\"\",\"MAKIET PRZECIW BLEKNIĘCIU\")","v":""},"",null,{"$f":"IF(D7=0,\"\",'Zamówieni SUPER PRICE'!AQ15)","v":""}]
[{"$f":"IF(D7=0,\"\",\"OSTATNI SEGMET NIE PODPIĘTY\")","v":""},"",null,{"$f":"IF(D7=0,\"\",'Zamówieni SUPER PRICE'!AR15)","v":""}]
[{"$f":"IF(D7=0,\"\",\"PAKOWANIE INDYWIDUALNE\")","v":""},"",null,{"$f":"IF(D7=0,\"\",'Zamówieni SUPER PRICE'!AS15)","v":""}]
[{"$f":"IF(D7=0,\"\",\"CENA\")","v":""},{"$f":"IF(D7=0,\"\",'Zamówieni SUPER PRICE'!AV15)","v":""}]
[{"$f":"IF(D7=0,\"\",\"UWAGI\")","v":""}]
[{"$f":"IF(D7=0,\"\",'Zamówieni SUPER PRICE'!AH28&\" \"&'Zamówieni SUPER PRICE'!AH32)","v":""},"="]
["=","="]
["=","="]
["=","="]
[{"$f":"IF(D8=0,\"\",'Zamówieni SUPER PRICE'!A1)","v":""},"=",8]
[{"$f":"IF(D8=0,\"\",'Zamówieni SUPER PRICE'!A2)","v":""},"="]
["=","="]
[{"$f":"IF(D8=0,\"\",\"NUMER ZLECENIA\")","v":""},"="]
[{"$f":"IF(D8=0,\"\",'Zamówieni SUPER PRICE'!AM2)","v":""},{"$f":"IF(D8=0,\"\",\"*\"&A6&\"*\")","v":""}]
["=","="]
["=","="]
[{"$f":"IF(D8=0,\"\",'Zamówieni SUPER PRICE'!V1)","v":""},{"$f":"IF(D8=0,\"\",'Zamówieni SUPER PRICE'!AD1)","v":""}]
[{"$f":"IF(D8=0,\"\",'Zamówieni SUPER PRICE'!V2)","v":""},{"$f":"IF(D8=0,\"\",'Zamówieni SUPER PRICE'!AD2)","v":""}]
[{"$f":"IF(D8=0,\"\",\"NUMER ZLECENIA KLIENTA\")","v":""},{"$f":"IF(D8=0,\"\",'Zamówieni SUPER PRICE'!L2)","v":""}]
[{"$f":"IF(D8=0,\"\",MID('Zamówieni SUPER PRICE'!A7,1,16))","v":""},{"$f":"IF(D8=0,\"\",MID('Zamówieni SUPER PRICE'!A7,18,16))","v":""}]
["=","="]
[{"$f":"IF(D8=0,\"\",\"Pozycja \"&'Zamówieni SUPER PRICE'!A16&\" z \" &'Zamówieni SUPER PRICE'!$AZ$19)","v":""},"="]
[{"$f":"IF(D8=0,\"\",\"ILOŚĆ SZTUK\")","v":""},{"$f":"IF(D8=0,\"\",'Zamówieni SUPER PRICE'!AT16)","v":""}]
[{"$f":"IF(D8=0,\"\",\"SZEROKOŚĆ\")","v":""},{"$f":"IF(D8=0,\"\",'Zamówieni SUPER PRICE'!B16)","v":""}]
[{"$f":"IF(D8=0,\"\",\"WYSOKOŚĆ\")","v":""},{"$f":"IF(D8=0,\"\",'Zamówieni SUPER PRICE'!D16)","v":""}]
[{"$f":"IF(D8=0,\"\",\"SZEROKOSĆ TKANINY\")","v":""},{"$f":"IF(D8=0,\"\",'Zamówieni SUPER PRICE'!F16)","v":""}]
[{"$f":"IF(D8=0,\"\",\"WYSOKOŚĆ MONTAŻU\")","v":""},{"$f":"IF(D8=0,\"\",IF('Zamówieni SUPER PRICE'!G16=\"\",\"-\",'Zamówieni SUPER PRICE'!G16))","v":""}]
[{"$f":"IF(D8=0,\"\",\"SYSTEM\")","v":""},{"$f":"IF(D8=0,\"\",'Zamówieni SUPER PRICE'!I16)","v":""}]
[{"$f":"IF(D8=0,\"\",\"MODEL\")","v":""},{"$f":"IF(D8=0,\"\",'Zamówieni SUPER PRICE'!L16)","v":""}]
["=","="]
[{"$f":"IF(D8=0,\"\",\"TYP\")","v":""},{"$f":"IF(D8=0,\"\",'Zamówieni SUPER PRICE'!N16)","v":""}]
[{"$f":"IF(D8=0,\"\",\"RODZAJ STEROWANIA\")","v":""},{"$f":"IF(D8=0,\"\",'Zamówieni SUPER PRICE'!O16)","v":""}]
[{"$f":"IF(D8=0,\"\",\"PRZEŁOŻENIE MECHANIZMU\")","v":""},{"$f":"IF(D347=0,\"1:1\",D347)","v":""},null,{"$f":"IF(D8=0,\"\",'Zamówieni SUPER PRICE'!P16)","v":""}]
[{"$f":"IF(D8=0,\"\",\"KOLEKCJA TKANINY\")","v":""},{"$f":"IF(D8=0,\"\",'Zamówieni SUPER PRICE'!Q16)","v":""}]
[{"$f":"IF(D8=0,\"\",\"KOLOR TKANINY\")","v":""},{"$f":"IF(D8=0,\"\",'Zamówieni SUPER PRICE'!U16)","v":""}]
[{"$f":"IF(D8=0,\"\",\"KIERUNEK SZYCIA\")","v":""},{"$f":"IF(D8=0,\"\",'Zamówieni SUPER PRICE'!X16)","v":""}]
[{"$f":"IF(D8=0,\"\",\"MECHANIZM OBOK TKANINY\")","v":""},{"$f":"IF(D351=0,\"-\",D351)","v":""},null,{"$f":"IF(D8=0,\"\",'Zamówieni SUPER PRICE'!Y16)","v":""}]
[{"$f":"IF(D8=0,\"\",\"SZPROSY\")","v":""},{"$f":"IF(D352=0,\"brak szprosów\",D352)","v":""},null,{"$f":"IF(D8=0,\"\",'Zamówieni SUPER PRICE'!Z16)","v":""}]
[{"$f":"IF(D8=0,\"\",\"WYKOŃCZENIE TUNELI\")","v":""},{"$f":"IF(D353=0,\"a. tunele odkryte\",D353)","v":""},null,{"$f":"IF(D8=0,\"\",'Zamówieni SUPER PRICE'!AD16)","v":""}]
["=",null,null,"=0"]
[{"$f":"IF(D8=0,\"\",\"OBCIĄŻNIK DOLNY\")","v":""},{"$f":"IF(D355=0,\"PS 5x20\",D355)","v":""},null,{"$f":"IF(D8=0,\"\",'Zamówieni SUPER PRICE'!AH16)","v":""}]
[{"$f":"IF(D8=0,\"\",\"MOCOWANIE GÓRNE\")","v":""},{"$f":"IF(D356=0,\"brak\",D356)","v":""},null,{"$f":"IF(D8=0,\"\",'Zamówieni SUPER PRICE'!AJ16)","v":""}]
[{"$f":"IF(D8=0,\"\",\"CHILD SAFETY \")","v":""},{"$f":"IF(D357=0,\"-\",D357)","v":""},null,{"$f":"IF(D8=0,\"\",'Zamówieni SUPER PRICE'!AM16)","v":""}]
[{"$f":"IF(D8=0,\"\",\"INNY ŁAŃCUSZEK\")","v":""},"",null,{"$f":"IF(D8=0,\"\",'Zamówieni SUPER PRICE'!AN16)","v":""}]
[{"$f":"IF(D8=0,\"\",\"LAMBREKIN\")","v":""},"",null,{"$f":"IF(D8=0,\"\",'Zamówieni SUPER PRICE'!AO16)","v":""}]
[{"$f":"IF(D8=0,\"\",\"ŻAGIEL\")","v":""},"",null,{"$f":"IF(D8=0,\"\",'Zamówieni SUPER PRICE'!AP16)","v":""}]
[{"$f":"IF(D8=0,\"\",\"MAKIET PRZECIW BLEKNIĘCIU\")","v":""},"",null,{"$f":"IF(D8=0,\"\",'Zamówieni SUPER PRICE'!AQ16)","v":""}]
[{"$f":"IF(D8=0,\"\",\"OSTATNI SEGMET NIE PODPIĘTY\")","v":""},"",null,{"$f":"IF(D8=0,\"\",'Zamówieni SUPER PRICE'!AR16)","v":""}]
[{"$f":"IF(D8=0,\"\",\"PAKOWANIE INDYWIDUALNE\")","v":""},"",null,{"$f":"IF(D8=0,\"\",'Zamówieni SUPER PRICE'!AS16)","v":""}]
[{"$f":"IF(D8=0,\"\",\"CENA\")","v":""},{"$f":"IF(D8=0,\"\",'Zamówieni SUPER PRICE'!AV16)","v":""}]
[{"$f":"IF(D8=0,\"\",\"UWAGI\")","v":""}]
[{"$f":"IF(D8=0,\"\",'Zamówieni SUPER PRICE'!AH29&\" \"&'Zamówieni SUPER PRICE'!AH32)","v":""},"="]
["=","="]
["=","="]
["=","="]
[{"$f":"IF(D9=0,\"\",'Zamówieni SUPER PRICE'!A1)","v":""},"=",9]
[{"$f":"IF(D9=0,\"\",'Zamówieni SUPER PRICE'!A2)","v":""},"="]
["=","="]
[{"$f":"IF(D9=0,\"\",\"NUMER ZLECENIA\")","v":""},"="]
[{"$f":"IF(D9=0,\"\",'Zamówieni SUPER PRICE'!AM2)","v":""},{"$f":"IF(D9=0,\"\",\"*\"&A6&\"*\")","v":""}]
["=","="]
["=","="]
[{"$f":"IF(D9=0,\"\",'Zamówieni SUPER PRICE'!V1)","v":""},{"$f":"IF(D9=0,\"\",'Zamówieni SUPER PRICE'!AD1)","v":""}]
[{"$f":"IF(D9=0,\"\",'Zamówieni SUPER PRICE'!V2)","v":""},{"$f":"IF(D9=0,\"\",'Zamówieni SUPER PRICE'!AD2)","v":""}]
[{"$f":"IF(D9=0,\"\",\"NUMER ZLECENIA KLIENTA\")","v":""},{"$f":"IF(D9=0,\"\",'Zamówieni SUPER PRICE'!L2)","v":""}]
[{"$f":"IF(D9=0,\"\",MID('Zamówieni SUPER PRICE'!A7,1,16))","v":""},{"$f":"IF(D9=0,\"\",MID('Zamówieni SUPER PRICE'!A7,18,16))","v":""}]
["=","="]
[{"$f":"IF(D9=0,\"\",\"Pozycja \"&'Zamówieni SUPER PRICE'!A17&\" z \" &'Zamówieni SUPER PRICE'!$AZ$19)","v":""},"="]
[{"$f":"IF(D9=0,\"\",\"ILOŚĆ SZTUK\")","v":""},{"$f":"IF(D9=0,\"\",'Zamówieni SUPER PRICE'!AT17)","v":""}]
[{"$f":"IF(D9=0,\"\",\"SZEROKOŚĆ\")","v":""},{"$f":"IF(D9=0,\"\",'Zamówieni SUPER PRICE'!B17)","v":""}]
[{"$f":"IF(D9=0,\"\",\"WYSOKOŚĆ\")","v":""},{"$f":"IF(D9=0,\"\",'Zamówieni SUPER PRICE'!D17)","v":""}]
[{"$f":"IF(D9=0,\"\",\"SZEROKOSĆ TKANINY\")","v":""},{"$f":"IF(D9=0,\"\",'Zamówieni SUPER PRICE'!F17)","v":""}]
[{"$f":"IF(D9=0,\"\",\"WYSOKOŚĆ MONTAŻU\")","v":""},{"$f":"IF(D9=0,\"\",'Zamówieni SUPER PRICE'!G17)","v":""}]
[{"$f":"IF(D9=0,\"\",\"SYSTEM\")","v":""},{"$f":"IF(D9=0,\"\",'Zamówieni SUPER PRICE'!I17)","v":""}]
[{"$f":"IF(D9=0,\"\",\"MODEL\")","v":""},{"$f":"IF(D9=0,\"\",'Zamówieni SUPER PRICE'!L17)","v":""}]
["=","="]
[{"$f":"IF(D9=0,\"\",\"TYP\")","v":""},{"$f":"IF(D9=0,\"\",'Zamówieni SUPER PRICE'!N17)","v":""}]
[{"$f":"IF(D9=0,\"\",\"RODZAJ STEROWANIA\")","v":""},{"$f":"IF(D9=0,\"\",'Zamówieni SUPER PRICE'!O17)","v":""}]
[{"$f":"IF(D9=0,\"\",\"PRZEŁOŻENIE MECHANIZMU\")","v":""},{"$f":"IF(D393=0,\"1:1\",D393)","v":""},null,{"$f":"IF(D9=0,\"\",'Zamówieni SUPER PRICE'!P17)","v":""}]
[{"$f":"IF(D9=0,\"\",\"KOLEKCJA TKANINY\")","v":""},{"$f":"IF(D9=0,\"\",'Zamówieni SUPER PRICE'!Q17)","v":""}]
[{"$f":"IF(D9=0,\"\",\"KOLOR TKANINY\")","v":""},{"$f":"IF(D9=0,\"\",'Zamówieni SUPER PRICE'!U17)","v":""}]
[{"$f":"IF(D9=0,\"\",\"KIERUNEK SZYCIA\")","v":""},{"$f":"IF(D9=0,\"\",'Zamówieni SUPER PRICE'!X17)","v":""}]
[{"$f":"IF(D9=0,\"\",\"MECHANIZM OBOK TKANINY\")","v":""},{"$f":"IF(D397=0,\"-\",D397)","v":""},null,{"$f":"IF(D9=0,\"\",'Zamówieni SUPER PRICE'!Y17)","v":""}]
[{"$f":"IF(D9=0,\"\",\"SZPROSY\")","v":""},{"$f":"IF(D398=0,\"brak szprosów\",D398)","v":""},null,{"$f":"IF(D9=0,\"\",'Zamówieni SUPER PRICE'!Z17)","v":""}]
[{"$f":"IF(D9=0,\"\",\"WYKOŃCZENIE TUNELI\")","v":""},{"$f":"IF(D399=0,\"a. tunele odkryte\",D399)","v":""},null,{"$f":"IF(D9=0,\"\",'Zamówieni SUPER PRICE'!AD16)","v":""}]
["=",null,null,"=0"]
[{"$f":"IF(D9=0,\"\",\"OBCIĄŻNIK DOLNY\")","v":""},{"$f":"IF(D401=0,\"PS 5x20\",D401)","v":""},null,{"$f":"IF(D9=0,\"\",'Zamówieni SUPER PRICE'!AH17)","v":""}]
[{"$f":"IF(D9=0,\"\",\"MOCOWANIE GÓRNE\")","v":""},{"$f":"IF(D402=0,\"brak\",D402)","v":""},null,{"$f":"IF(D9=0,\"\",'Zamówieni SUPER PRICE'!AJ17)","v":""}]
[{"$f":"IF(D9=0,\"\",\"CHILD SAFETY \")","v":""},{"$f":"IF(D403=0,\"-\",D403)","v":""},null,{"$f":"IF(D9=0,\"\",'Zamówieni SUPER PRICE'!AM16)","v":""}]
[{"$f":"IF(D9=0,\"\",\"INNY ŁAŃCUSZEK\")","v":""},"",null,{"$f":"IF(D9=0,\"\",'Zamówieni SUPER PRICE'!AN17)","v":""}]
[{"$f":"IF(D9=0,\"\",\"LAMBREKIN\")","v":""},"",null,{"$f":"IF(D9=0,\"\",'Zamówieni SUPER PRICE'!AO17)","v":""}]
[{"$f":"IF(D9=0,\"\",\"ŻAGIEL\")","v":""},"",null,{"$f":"IF(D9=0,\"\",'Zamówieni SUPER PRICE'!AP17)","v":""}]
[{"$f":"IF(D9=0,\"\",\"MAKIET PRZECIW BLEKNIĘCIU\")","v":""},"",null,{"$f":"IF(D9=0,\"\",'Zamówieni SUPER PRICE'!AQ17)","v":""}]
[{"$f":"IF(D9=0,\"\",\"OSTATNI SEGMET NIE PODPIĘTY\")","v":""},"",null,{"$f":"IF(D9=0,\"\",'Zamówieni SUPER PRICE'!AR17)","v":""}]
[{"$f":"IF(D9=0,\"\",\"PAKOWANIE INDYWIDUALNE\")","v":""},"",null,{"$f":"IF(D9=0,\"\",'Zamówieni SUPER PRICE'!AS17)","v":""}]
[{"$f":"IF(D9=0,\"\",\"CENA\")","v":""},{"$f":"IF(D9=0,\"\",'Zamówieni SUPER PRICE'!AV17)","v":""}]
[{"$f":"IF(D9=0,\"\",\"UWAGI\")","v":""}]
[{"$f":"IF(D9=0,\"\",'Zamówieni SUPER PRICE'!AH30&\" \"&'Zamówieni SUPER PRICE'!AH32)","v":""},"="]
["=","="]
["=","="]
["=","="]
[{"$f":"IF(D10=0,\"\",'Zamówieni SUPER PRICE'!A1)","v":""},"=",10]
[{"$f":"IF(D10=0,\"\",'Zamówieni SUPER PRICE'!A2)","v":""},"="]
["=","="]
[{"$f":"IF(D10=0,\"\",\"NUMER ZLECENIA\")","v":""},"="]
[{"$f":"IF(D10=0,\"\",'Zamówieni SUPER PRICE'!AM2)","v":""},{"$f":"IF(D10=0,\"\",\"*\"&A6&\"*\")","v":""}]
["=","="]
["=","="]
[{"$f":"IF(D10=0,\"\",'Zamówieni SUPER PRICE'!V1)","v":""},{"$f":"IF(D10=0,\"\",'Zamówieni SUPER PRICE'!AD1)","v":""}]
[{"$f":"IF(D10=0,\"\",'Zamówieni SUPER PRICE'!V2)","v":""},{"$f":"IF(D10=0,\"\",'Zamówieni SUPER PRICE'!AD2)","v":""}]
[{"$f":"IF(D10=0,\"\",\"NUMER ZLECENIA KLIENTA\")","v":""},{"$f":"IF(D10=0,\"\",'Zamówieni SUPER PRICE'!L2)","v":""}]
[{"$f":"IF(D10=0,\"\",MID('Zamówieni SUPER PRICE'!A7,1,16))","v":""},{"$f":"IF(D10=0,\"\",MID('Zamówieni SUPER PRICE'!A7,18,16))","v":""}]
["=","="]
[{"$f":"IF(D10=0,\"\",\"Pozycja \"&'Zamówieni SUPER PRICE'!A18&\" z \" &'Zamówieni SUPER PRICE'!$AZ$19)","v":""},"="]
[{"$f":"IF(D10=0,\"\",\"ILOŚĆ SZTUK\")","v":""},{"$f":"IF(D10=0,\"\",'Zamówieni SUPER PRICE'!AT18)","v":""}]
[{"$f":"IF(D10=0,\"\",\"SZEROKOŚĆ\")","v":""},{"$f":"IF(D10=0,\"\",'Zamówieni SUPER PRICE'!B18)","v":""}]
[{"$f":"IF(D10=0,\"\",\"WYSOKOŚĆ\")","v":""},{"$f":"IF(D10=0,\"\",'Zamówieni SUPER PRICE'!D18)","v":""}]
[{"$f":"IF(D10=0,\"\",\"SZEROKOSĆ TKANINY\")","v":""},{"$f":"IF(D10=0,\"\",'Zamówieni SUPER PRICE'!F18)","v":""}]
[{"$f":"IF(D10=0,\"\",\"WYSOKOŚĆ MONTAŻU\")","v":""},{"$f":"IF(D10=0,\"\",'Zamówieni SUPER PRICE'!G18)","v":""}]
[{"$f":"IF(D10=0,\"\",\"SYSTEM\")","v":""},{"$f":"IF(D10=0,\"\",'Zamówieni SUPER PRICE'!I18)","v":""}]
[{"$f":"IF(D10=0,\"\",\"MODEL\")","v":""},{"$f":"IF(D10=0,\"\",'Zamówieni SUPER PRICE'!L18)","v":""}]
["=","="]
[{"$f":"IF(D10=0,\"\",\"TYP\")","v":""},{"$f":"IF(D10=0,\"\",'Zamówieni SUPER PRICE'!N18)","v":""}]
[{"$f":"IF(D10=0,\"\",\"RODZAJ STEROWANIA\")","v":""},{"$f":"IF(D10=0,\"\",'Zamówieni SUPER PRICE'!O18)","v":""}]
[{"$f":"IF(D10=0,\"\",\"PRZEŁOŻENIE MECHANIZMU\")","v":""},{"$f":"IF(D439=0,\"1:1\",D439)","v":""},null,{"$f":"IF(D10=0,\"\",'Zamówieni SUPER PRICE'!P18)","v":""}]
[{"$f":"IF(D10=0,\"\",\"KOLEKCJA TKANINY\")","v":""},{"$f":"IF(D10=0,\"\",'Zamówieni SUPER PRICE'!Q18)","v":""}]
[{"$f":"IF(D10=0,\"\",\"KOLOR TKANINY\")","v":""},{"$f":"IF(D10=0,\"\",'Zamówieni SUPER PRICE'!U18)","v":""}]
[{"$f":"IF(D10=0,\"\",\"KIERUNEK SZYCIA\")","v":""},{"$f":"IF(D10=0,\"\",'Zamówieni SUPER PRICE'!X18)","v":""}]
[{"$f":"IF(D10=0,\"\",\"MECHANIZM OBOK TKANINY\")","v":""},{"$f":"IF(D443=0,\"-\",D443)","v":""},null,{"$f":"IF(D10=0,\"\",'Zamówieni SUPER PRICE'!Y18)","v":""}]
[{"$f":"IF(D10=0,\"\",\"SZPROSY\")","v":""},{"$f":"IF(D444=0,\"brak szprosów\",D444)","v":""},null,{"$f":"IF(D10=0,\"\",'Zamówieni SUPER PRICE'!Z18)","v":""}]
[{"$f":"IF(D10=0,\"\",\"WYKOŃCZENIE TUNELI\")","v":""},{"$f":"IF(D445=0,\"a. tunele odkryte\",D445)","v":""},null,{"$f":"IF(D10=0,\"\",'Zamówieni SUPER PRICE'!AD18)","v":""}]
["=",null,null,"=0"]
[{"$f":"IF(D10=0,\"\",\"OBCIĄŻNIK DOLNY\")","v":""},{"$f":"IF(D447=0,\"PS 5x20\",D447)","v":""},null,{"$f":"IF(D10=0,\"\",'Zamówieni SUPER PRICE'!AH18)","v":""}]
[{"$f":"IF(D10=0,\"\",\"MOCOWANIE GÓRNE\")","v":""},{"$f":"IF(D448=0,\"brak\",D448)","v":""},null,{"$f":"IF(D10=0,\"\",'Zamówieni SUPER PRICE'!AJ18)","v":""}]
[{"$f":"IF(D10=0,\"\",\"CHILD SAFETY \")","v":""},{"$f":"IF(D449=0,\"-\",D449)","v":""},null,{"$f":"IF(D10=0,\"\",'Zamówieni SUPER PRICE'!AM18)","v":""}]
[{"$f":"IF(D10=0,\"\",\"INNY ŁAŃCUSZEK\")","v":""},"",null,{"$f":"IF(D10=0,\"\",'Zamówieni SUPER PRICE'!AN18)","v":""}]
[{"$f":"IF(D10=0,\"\",\"LAMBREKIN\")","v":""},"",null,{"$f":"IF(D10=0,\"\",'Zamówieni SUPER PRICE'!AO18)","v":""}]
[{"$f":"IF(D10=0,\"\",\"ŻAGIEL\")","v":""},"",null,{"$f":"IF(D10=0,\"\",'Zamówieni SUPER PRICE'!AP18)","v":""}]
[{"$f":"IF(D10=0,\"\",\"MAKIET PRZECIW BLEKNIĘCIU\")","v":""},"",null,{"$f":"IF(D10=0,\"\",'Zamówieni SUPER PRICE'!AQ18)","v":""}]
[{"$f":"IF(D10=0,\"\",\"OSTATNI SEGMET NIE PODPIĘTY\")","v":""},"",null,{"$f":"IF(D10=0,\"\",'Zamówieni SUPER PRICE'!AR18)","v":""}]
[{"$f":"IF(D10=0,\"\",\"PAKOWANIE INDYWIDUALNE\")","v":""},"",null,{"$f":"IF(D10=0,\"\",'Zamówieni SUPER PRICE'!AS18)","v":""}]
[{"$f":"IF(D10=0,\"\",\"CENA\")","v":""},{"$f":"IF(D10=0,\"\",'Zamówieni SUPER PRICE'!AV18)","v":""}]
[{"$f":"IF(D10=0,\"\",\"UWAGI\")","v":""}]
[{"$f":"IF(D10=0,\"\",'Zamówieni SUPER PRICE'!AH31&\" \"&'Zamówieni SUPER PRICE'!AH32)","v":""},"="]
["=","="]
["=","="]
["=","="]
[{"$f":"IF(E482=0,\"\",'[1]Zamówieni SUPER PRICE'!A1)","v":""},"=",11]
[{"$f":"IF(E482=0,\"\",'[1]Zamówieni SUPER PRICE'!A2)","v":""},"="]
["=","="]
[{"$f":"IF(E482=0,\"\",\"NUMER ZLECENIA\")","v":""},"="]
[{"$f":"IF(E482=0,\"\",'[1]Zamówieni SUPER PRICE'!AM2)","v":""},{"$f":"IF(E482=0,\"\",\"*\"&A6&\"*\")","v":""}]
["=","="]
["=","="]
[{"$f":"IF(E482=0,\"\",'[1]Zamówieni SUPER PRICE'!V1)","v":""},{"$f":"IF(E482=0,\"\",'[1]Zamówieni SUPER PRICE'!AD1)","v":""}]
[{"$f":"IF(E482=0,\"\",'[1]Zamówieni SUPER PRICE'!V2)","v":""},{"$f":"IF(E482=0,\"\",'[1]Zamówieni SUPER PRICE'!AD2)","v":""}]
[{"$f":"IF(E482=0,\"\",\"NUMER ZLECENIA KLIENTA\")","v":""},{"$f":"IF(E482=0,\"\",'[1]Zamówieni SUPER PRICE'!L2)","v":""}]
[{"$f":"IF(E482=0,\"\",MID('[1]Zamówieni SUPER PRICE'!A7,1,16))","v":""},{"$f":"IF(E482=0,\"\",MID('[1]Zamówieni SUPER PRICE'!A7,18,16))","v":""}]
["=","="]
[{"$f":"IF(E482=0,\"\",\"Dodatki do sterowania elektrycznego\")","v":""},"="]
[{"$f":"IF(D475=0,\"\",D475)","v":""},{"$f":"IF(E475=0,\"\",E475)","v":""},null,{"$f":"'Zamówieni SUPER PRICE'!K24","v":0},{"$f":"'Zamówieni SUPER PRICE'!T24","v":0},{"$f":"'Zamówieni SUPER PRICE'!V24","v":0}]
[null,{"$f":"IF(F475=0,\"\",F475)","v":""},null,{"$f":"'Zamówieni SUPER PRICE'!K25","v":0},{"$f":"'Zamówieni SUPER PRICE'!T25","v":0},{"$f":"'Zamówieni SUPER PRICE'!V25","v":0}]
[{"$f":"IF(D476=0,\"\",D476)","v":""},{"$f":"IF(E476=0,\"\",E476)","v":""},null,{"$f":"'Zamówieni SUPER PRICE'!K26","v":0},{"$f":"'Zamówieni SUPER PRICE'!T26","v":0},{"$f":"'Zamówieni SUPER PRICE'!V26","v":0}]
[null,{"$f":"IF(F476=0,\"\",F476)","v":""},null,{"$f":"'Zamówieni SUPER PRICE'!K27","v":0},{"$f":"'Zamówieni SUPER PRICE'!T27","v":0},{"$f":"'Zamówieni SUPER PRICE'!V27","v":0}]
[{"$f":"IF(D477=0,\"\",D477)","v":""},{"$f":"IF(E477=0,\"\",E477)","v":""},null,{"$f":"'Zamówieni SUPER PRICE'!K28","v":0},{"$f":"'Zamówieni SUPER PRICE'!T28","v":0},{"$f":"'Zamówieni SUPER PRICE'!V28","v":0}]
[null,{"$f":"IF(F477=0,\"\",F477)","v":""},null,{"$f":"'Zamówieni SUPER PRICE'!K29","v":0},{"$f":"'Zamówieni SUPER PRICE'!T29","v":0},{"$f":"'Zamówieni SUPER PRICE'!V29","v":0}]
[{"$f":"IF(D478=0,\"\",D478)","v":""},{"$f":"IF(E478=0,\"\",E478)","v":""},null,{"$f":"'Zamówieni SUPER PRICE'!K30","v":0},{"$f":"'Zamówieni SUPER PRICE'!T30","v":0},{"$f":"'Zamówieni SUPER PRICE'!V30","v":0}]
[null,{"$f":"IF(F478=0,\"\",F478)","v":""},null,null,{"$f":"SUM(E475:E481)","v":0},{"$f":"SUM(F475:F481)","v":0}]
[{"$f":"IF(D479=0,\"\",D479)","v":""},{"$f":"IF(E479=0,\"\",E479)","v":""}]
[null,{"$f":"IF(F479=0,\"\",F479)","v":""}]
[{"$f":"IF(D480=0,\"\",D480)","v":""},{"$f":"IF(E480=0,\"\",E480)","v":""}]
[null,{"$f":"IF(F480=0,\"\",F480)","v":""}]
[{"$f":"IF(D481=0,\"\",D481)","v":""},{"$f":"IF(E481=0,\"\",E481)","v":""}]
[null,{"$f":"IF(F481=0,\"\",F481)","v":""}]
[{"$f":"IF(D481=0,\"\",\"SUMA za dodatki\")","v":""},{"$f":"IF(D481=0,\"\",F482)","v":""}]